{"text_format":"1","workbook":"xlsx","n_sheets":6,"sheets":["Etagement","Autres graphes","Documentation","Manual","Calculs de Vitesses","traductions"],"not_rendered":{"charts":6,"images":1,"macros":1,"external_links":0,"defined_names":88,"comments":0,"pivot_tables":0},"unopened":[],"bounds":{"document_bytes":16777216,"sheet_cells":100000,"rows_first":2000,"rows_last":500,"rows_between":2000,"halvings":0,"cell_chars":16384,"cell_head_chars":4096},"cells_cut":0,"cells_raw":0,"read":"whole","date_system":"1900"}

{"sheet":"Etagement","index":0,"n_rows":300,"n_cols":85,"rows_kept":300,"cut":false,"hidden":false,"merged":[[29,17,30,19],[29,5,30,7],[29,9,30,11],[12,1,12,2],[4,1,4,2],[15,1,15,2],[29,13,30,15],[5,1,5,2],[8,1,8,2],[16,1,16,2],[17,1,17,2],[6,1,6,2],[7,1,7,2],[11,1,11,2]]}
[]
[null,"Copyright Olivier ADLER 2024",null,null,null,null,"RPM","Couple"]
[null,"MotorSport@StoneRecording.art",null,null,null,null,750,79]
["Version 5.0",null,null,null,null,null,1000,106]
[null,{"$f":"HLOOKUP(traductions!$B$3,traductions!$E4:$F44,10,FALSE)","v":"Green values can be modified"},null,null,null,null,1250,135]
[null,{"$f":"HLOOKUP(traductions!$B$3,traductions!$E4:$F44,2,FALSE)","v":"Speed number (n)"},null,6,null,null,1500,162]
[null,{"$f":"HLOOKUP(traductions!$B$3,traductions!$E4:$F44,3,FALSE)","v":"First speed ratio (R1)"},null,4.2,null,null,1750,190]
[null,{"$f":"HLOOKUP(traductions!$B$3,traductions!$E4:$F44,4,FALSE)","v":"Last speed ratio (Rn)"},null,0.88,null,null,2000,220]
[null,{"$f":"HLOOKUP(traductions!$B$3,traductions!$E4:$F44,5,FALSE)","v":"Differential gearing or final gearing"},null,4.1100000000000003,null,null,2250,250]
[null,{"$f":"HLOOKUP(traductions!$B$3,traductions!$E4:$F44,6,FALSE)","v":"Transfercase long gearing ratio"},null,1,null,null,2500,270]
[null,{"$f":"HLOOKUP(traductions!$B$3,traductions!$E4:$F44,7,FALSE)","v":"Transfercase short gearing ratio"},null,2.4900000000000002,null,null,2750,280]
[null,{"$f":"HLOOKUP(traductions!$B$3,traductions!$E4:$F44,8,FALSE)","v":"Logarithmic coefficient (k)"},null,0.1,null,null,3000,275]
[null,null,null,null,null,null,3250,260]
[null,{"$f":"HLOOKUP(traductions!$B$3,traductions!$E4:$F44,9,FALSE)","v":"Calculated linear spacing coefficient (r)"},null,{"$f":"(D8/D7)^(1/(D6-1))","v":0.73155448353600716},null,null,3500,245]
[null,null,null,null,null,null,3750,222]
[null,{"$f":"HLOOKUP(traductions!$B$3,traductions!$E4:$F44,11,FALSE)","v":"Tires"},null,null,null,null,4000,198]
[null,{"$f":"HLOOKUP(traductions!$B$3,traductions!$E4:$F44,12,FALSE)","v":"Diameter (inches)"},null,16,null,null,4700,140]
[null,{"$f":"HLOOKUP(traductions!$B$3,traductions!$E4:$F44,13,FALSE)","v":"Width (mm)"},null,275,null,null,4800,130]
[null,{"$f":"HLOOKUP(traductions!$B$3,traductions!$E4:$F44,14,FALSE)","v":"Sidewall height (percent of width)"},null,70,null,null,4900,50]
[null,{"$f":"HLOOKUP(traductions!$B$3,traductions!$E4:$F44,15,FALSE)","v":"Crushing coefficient"},null,0.97]
[null,{"$f":"HLOOKUP(traductions!$B$3,traductions!$E4:$F44,16,FALSE)","v":"Calculated effective radius (m)"},null,{"$f":"$D$23*$D$20/2/1000","v":0.38382899999999998}]
[null,{"$f":"HLOOKUP(traductions!$B$3,traductions!$E4:$F44,17,FALSE)","v":"Calculated flank height (mm)"},null,{"$f":"$D$18*$D$19/100","v":192.5}]
[null,{"$f":"HLOOKUP(traductions!$B$3,traductions!$E4:$F44,18,FALSE)","v":"Calculated total diameter (mm)"},null,{"$f":"$D$17*25.4+2*$D$22","v":791.4}]
[null,{"$f":"HLOOKUP(traductions!$B$3,traductions!$E4:$F44,19,FALSE)","v":"Calculated circumference (m)"},null,{"$f":"PI()*$D$23/1000","v":2.4862564260509621}]
[]
[null,"Résistance aérodynamique"]
[]
[null,null,{"$f":"HLOOKUP(traductions!$B$3,traductions!$E4:$F44,20,FALSE)","v":"Frontal area in m²"},2.2000000000000002]
[null,null,{"$f":"HLOOKUP(traductions!$B$3,traductions!$E4:$F44,21,FALSE)","v":"Drag coefficient"},0.32]
[null,null,{"$f":"HLOOKUP(traductions!$B$3,traductions!$E4:$F44,22,FALSE)","v":"Air density in kg/m3"},1.2,null,{"$f":"HLOOKUP(traductions!$B$3,traductions!$E4:$F44,27,FALSE)","v":"Logarithmic spacing (long ratios)"},null,null,null,{"$f":"HLOOKUP(traductions!$B$3,traductions!$E4:$F44,28,FALSE)","v":"Logarithmic spacing (short ratios)"},null,null,null,{"$f":"HLOOKUP(traductions!$B$3,traductions!$E4:$F44,29,FALSE)","v":"Linear spacing (long ratios)"},null,null,null,{"$f":"HLOOKUP(traductions!$B$3,traductions!$E4:$F44,30,FALSE)","v":"Linear spacing (short ratios)"}]
[]
[null,"Résistance au roulement ",null,null,null,"Vitesse","Rapport","Différences",null,"Vitesse","Rapport","Différences",null,"Vitesse","Rapport","Différences",null,"Vitesse","Rapport","Différences"]
[null,null,null,null,null,{"$f":"IF(20-(ROW(F$52)-ROW(F33))<=$D$6,20-(ROW(F$52)-ROW(F33)),\"\")","v":1},{"$f":"IF(F33<=$D$6,$D$43*($D$8/$D$7)^(LOG10((F33-1)*($D$12)+1)/$D$46),\"NA()\")","v":4.2},null,null,{"$f":"IF(20-(ROW(J$52)-ROW(J33))<=$D$6,20-(ROW(J$52)-ROW(J33)),\"\")","v":1},{"$f":"IF(J33<=$D$6,$D$44*($D$8/$D$7)^(LOG10((J33-1)*($D$12)+1)/$D$46),\"\")","v":10.458000000000002},null,null,{"$f":"IF(20-(ROW(N$52)-ROW(N33))<=$D$6,20-(ROW(N$52)-ROW(N33)),\"\")","v":1},{"$f":"IF(N33<=$D$6,$D$43*$D$14^(N33-1),\"\")","v":4.2},null,null,{"$f":"IF(20-(ROW(R$52)-ROW(R33))<=$D$6,20-(ROW(R$52)-ROW(R33)),\"\")","v":1},{"$f":"IF(R33<=$D$6,$D$44*$D$14^(R33-1),\"\")","v":10.458000000000002}]
[null,null,null,null,null,2,{"$f":"IF(F34<=$D$6,$D$43*($D$8/$D$7)^(LOG10((F34-1)*($D$12)+1)/$D$46),\"NA()\")","v":2.9086791099851217},{"$f":"IF(F34=\"\",\"\",(G34/G33)-1)","v":-0.30745735476544722},null,2,7.2426109838629547,{"$f":"IF(J34=\"\",\"\",(K34/K33)-1)","v":-0.30745735476544722},null,2,3.0725288308512302,{"$f":"IF(N34=\"\",\"\",(O34/O33)-1)","v":-0.26844551646399284},null,2,7.6505967888195645,{"$f":"IF(R34=\"\",\"\",(S34/S33)-1)","v":-0.26844551646399284}]
[null,null,{"$f":"HLOOKUP(traductions!$B$3,traductions!$E4:$F44,23,FALSE)","v":"Vehicle mass in kg"},1600,null,3,2.0798638099632658,{"$f":"IF(F35=\"\",\"\",(G35/G34)-1)","v":-0.28494559512482465},null,3,5.1788608868085326,-0.28494559512482476,null,3,2.247722242002864,-0.26844551646399273,null,3,5.5968283825871321,-0.26844551646399273]
[null,null,{"$f":"HLOOKUP(traductions!$B$3,traductions!$E4:$F44,24,FALSE)","v":"Rolling coefficient"},0.01,null,4,1.5277062197468301,-0.26547776232819198,null,4,3.8039884871696077,-0.26547776232819198,null,4,1.6443312838808011,{"$f":"IF(N36=\"\",\"\",(O36/O35)-1)","v":-0.26844551646399295},null,4,4.0943848968631951,-0.26844551646399295]
[null,null,{"$f":"HLOOKUP(traductions!$B$3,traductions!$E4:$F44,25,FALSE)","v":"Gravity in m/s²"},9.81,null,5,1.1481002367304913,-0.24848100905110315,null,5,2.858769589458924,-0.24848100905110315,null,5,1.2029179231415192,{"$f":"IF(N37=\"\",\"\",(O37/O36)-1)","v":-0.26844551646399273},null,5,2.9952656286223833,-0.26844551646399262]
[null,{"$f":"HLOOKUP(traductions!$B$3,traductions!$E4:$F44,26,FALSE)","v":"Calculated rolling resistance in N"},null,156.96,null,6,0.88,-0.2335164022733548,null,6,2.1912000000000003,-0.23351640227335491,null,6,0.88000000000000045,-0.26844551646399284,null,6,2.1912000000000011,-0.26844551646399295]
[null,null,null,null,null,"","NA()","",null,"","","",null,"","","",null,"","",""]
[null,null,null,null,null,"","NA()","",null,"","","",null,"","","",null,"","",""]
[null,"Calculs intermédiaires",null,null,null,"","NA()","",null,"","","",null,"","","",null,"","",""]
[null,null,null,null,null,"","NA()","",null,"","","",null,"","","",null,"","",""]
[null,"Rapport de base 1ère longue",null,{"$f":"$D$7*$D$10","v":4.2},null,"","NA()","",null,"","","",null,"","","",null,"","",""]
[null,"Rapport de base 1ère courte",null,{"$f":"$D$7*$D$11","v":10.458000000000002},null,"","NA()","",null,"","","",null,"","","",null,"","",""]
[null,"Coeff1",null,{"$f":"$D$43*($D$8/$D$7)","v":0.88},null,"","NA()","",null,"","","",null,"","","",null,"","",""]
[null,"Coeff2",null,{"$f":"LOG10(($D$6-1)*$D$12+1)","v":0.17609125905568124},null,"","NA()","",null,"","","",null,"","","",null,"","",""]
[null,"Speed1",null,{"$f":"$D$10*$G$33*$D$9/($D$24*$D$20*60/1000)","v":119.29499107034198},null,"","NA()","",null,"","","",null,"","","",null,"","",""]
[null,"Speeds",null,{"$f":"$D$10*$D$9/($D$24*$D$20*60/1000)","v":28.40356930246238},null,"","NA()","",null,"","","",null,"","","",null,"","",""]
[null,"Rapport final long",null,{"$f":"$D$9*$D$10","v":4.1100000000000003},null,"","NA()","",null,"","","",null,"","","",null,"","",""]
[null,"Nombre de lignes couple moteur",null,{"$f":"COUNTA(couples[Couple])","v":17},null,"","NA()","",null,"","","",null,"","","",null,"","",""]
[null,null,null,null,null,"","NA()","",null,"","","",null,"","","",null,"","",""]
[null,null,null,null,null,"","NA()","",null,"","","",null,"","","",null,"","",""]
[]
[]
[null,null,null,null,1,1,1,1,1,2,2,2,2,3,3,3,3,4,4,4,4,5,5,5,5,6,6,6,6,7,7,7,7,8,8,8,8,9,9,9,9,10,10,10,10,11,11,11,11,12,12,12,12,13,13,13,13,14,14,14,14,15,15,15,15,16,16,16,16,17,17,17,17,18,18,18,18,19,19,19,19,20,20,20,20]
[null,null,null,null,"RPM1","Torque","Torque1","Speed1","Traction1","RPM2","Torque2","Speed2","Traction2","RPM3","Torque3","Speed3","Traction3","RPM4","Torque4","Speed4","Traction4","RPM5","Torque5","Speed5","Traction5","RPM6","Torque6","Speed6","Traction6","RPM7","Torque7","Speed7","Traction7","RPM8","Torque8","Speed8","Traction8","RPM9","Torque9","Speed9","Traction9","RPM10","Torque10","Speed10","Traction10","RPM11","Torque11","Speed11","Traction11","RPM12","Torque12","Speed12","Traction12","RPM13","Torque13","Speed13","Traction13","RPM14","Torque14","Speed14","Traction14","RPM15","Torque15","Speed15","Traction15","RPM16","Torque16","Speed16","Traction16","RPM17","Torque17","Speed17","Traction17","RPM18","Torque18","Speed18","Traction18","RPM19","Torque19","Speed19","Traction19","RPM20","Torque20","Speed20","Traction20"]
[null,null,null,null,{"$f":"IF(E$55<=$D$6,_xlfn.LET(_xlpm.tblRPM,couples[RPM],_xlpm.nbLines,COUNTA(_xlpm.tblRPM),IF(_xlfn.SEQUENCE(_xlpm.nbLines+1)<=_xlpm.nbLines,INDEX(_xlpm.tblRPM,_xlfn.SEQUENCE(_xlpm.nbLines)),INDEX(_xlpm.tblRPM,_xlpm.nbLines))),NA())","v":750},{"$f":"IF(G$55<=$D$6,_xlfn.LET(_xlpm.tblTorque,couples[Couple],_xlpm.nbLines,COUNTA(_xlpm.tblTorque),IF(_xlfn.SEQUENCE(_xlpm.nbLines+1,1)<=_xlpm.nbLines,INDEX(_xlpm.tblTorque,_xlfn.SEQUENCE(_xlpm.nbLines)),0)),NA())","v":79},{"$f":"IF(G$55<=$D$6,OFFSET($F57,0,0,$D$50+1)*$D$49*$G$33,NA())","v":1363.6980000000001},{"$f":"OFFSET($E57,0,0,$D$50+1)/($D$48*$G33)","v":6.2869362181163533},{"$f":"IF(I$55<=$D$6,OFFSET($F57,0,0,$D$50+1)*$D$49*$G$33/$D$21,NA())","v":3552.8790164370075},{"$f":"IF(J$55<=$D$6,OFFSET($E$57,0,0,$D$50+1),NA())","v":750},{"$f":"IF(K$55<=$D$6,OFFSET($F57,0,0,$D$50+1)*$D$49*$G$34,NA())","v":944.4190202210691},{"$f":"IF(L$55<=$D$6,OFFSET($E57,0,0,$D$50+1)/($D$48*$G34),NA())","v":9.0780492167194584},{"$f":"IF(M$55<=$D$6,OFFSET($F57,0,0,$D$50+1)*$D$49*$G$34/$D$21,NA())","v":2460.5202322416212},{"$f":"IF(N$55<=$D$6,OFFSET($E$57,0,0,$D$50+1),NA())","v":750},{"$f":"IF(O$55<=$D$6,OFFSET($F57,0,0,$D$50+1)*$D$49*$G$35,NA())","v":675.31098045697274},{"$f":"IF(P$55<=$D$6,OFFSET($E57,0,0,$D$50+1)/($D$48*$G35),NA())","v":12.695606313066742},{"$f":"IF(Q$55<=$D$6,OFFSET($F57,0,0,$D$50+1)*$D$49*$G$35/$D$21,NA())","v":1759.4058303488605},{"$f":"IF(R$55<=$D$6,OFFSET($E$57,0,0,$D$50+1),NA())","v":750},{"$f":"IF(S$55<=$D$6,OFFSET($F57,0,0,$D$50+1)*$D$49*$G$36,NA())","v":496.03093248959823},{"$f":"IF(T$55<=$D$6,OFFSET($E57,0,0,$D$50+1)/($D$48*$G36),NA())","v":17.284168758875978},{"$f":"IF(U$55<=$D$6,OFFSET($F57,0,0,$D$50+1)*$D$49*$G$36/$D$21,NA())","v":1292.3227074806705},{"$f":"IF(V$55<=$D$6,OFFSET($E$57,0,0,$D$50+1),NA())","v":750},{"$f":"IF(W$55<=$D$6,OFFSET($F57,0,0,$D$50+1)*$D$49*$G$37,NA())","v":372.77666586402324},{"$f":"IF(X$55<=$D$6,OFFSET($E57,0,0,$D$50+1)/($D$48*$G37),NA())","v":22.998978025894363},{"$f":"IF(Y$55<=$D$6,OFFSET($F57,0,0,$D$50+1)*$D$49*$G$37/$D$21,NA())","v":971.2050571062199},{"$f":"IF(Z$55<=$D$6,OFFSET($E$57,0,0,$D$50+1),NA())","v":750},{"$f":"IF(AA$55<=$D$6,OFFSET($F57,0,0,$D$50+1)*$D$49*$G$38,NA())","v":285.72719999999998},{"$f":"IF(AB$55<=$D$6,OFFSET($E57,0,0,$D$50+1)/($D$48*$G38),NA())","v":30.005831950100774},{"$f":"IF(AC$55<=$D$6,OFFSET($F57,0,0,$D$50+1)*$D$49*$G$38/$D$21,NA())","v":744.41274630108717},{"$f":"IF(AD$55<=$D$6,OFFSET($E$57,0,0,$D$50+1),NA())","v":{"$error":"#N/A"}},{"$f":"IF(AE$55<=$D$6,OFFSET($F57,0,0,$D$50+1)*$D$49*$G$39,NA())","v":{"$error":"#N/A"}},{"$f":"IF(AF$55<=$D$6,OFFSET($E57,0,0,$D$50+1)/($D$48*$G39),NA())","v":{"$error":"#N/A"}},{"$f":"IF(AG$55<=$D$6,OFFSET($F57,0,0,$D$50+1)*$D$49*$G$39/$D$21,NA())","v":{"$error":"#N/A"}},{"$f":"IF(AH$55<=$D$6,OFFSET($E$57,0,0,$D$50+1),NA())","v":{"$error":"#N/A"}},{"$f":"IF(AI$55<=$D$6,OFFSET($F57,0,0,$D$50+1)*$D$49*$G$40,NA())","v":{"$error":"#N/A"}},{"$f":"IF(AJ$55<=$D$6,OFFSET($E57,0,0,$D$50+1)/($D$48*$G40),NA())","v":{"$error":"#N/A"}},{"$f":"IF(AK$55<=$D$6,OFFSET($F57,0,0,$D$50+1)*$D$49*$G$40/$D$21,NA())","v":{"$error":"#N/A"}},{"$f":"IF(AL$55<=$D$6,OFFSET($E$57,0,0,$D$50+1),NA())","v":{"$error":"#N/A"}},{"$f":"IF(AM$55<=$D$6,OFFSET($F57,0,0,$D$50+1)*$D$49*$G$41,NA())","v":{"$error":"#N/A"}},{"$f":"IF(AN$55<=$D$6,OFFSET($E57,0,0,$D$50+1)/($D$48*$G41),NA())","v":{"$error":"#N/A"}},{"$f":"IF(AO$55<=$D$6,OFFSET($F57,0,0,$D$50+1)*$D$49*$G$41/$D$21,NA())","v":{"$error":"#N/A"}},{"$f":"IF(AP$55<=$D$6,OFFSET($E$57,0,0,$D$50+1),NA())","v":{"$error":"#N/A"}},{"$f":"IF(AQ$55<=$D$6,OFFSET($F57,0,0,$D$50+1)*$D$49*$G$42,NA())","v":{"$error":"#N/A"}},{"$f":"IF(AR$55<=$D$6,OFFSET($E57,0,0,$D$50+1)/($D$48*$G42),NA())","v":{"$error":"#N/A"}},{"$f":"IF(AS$55<=$D$6,OFFSET($F57,0,0,$D$50+1)*$D$49*$G$42/$D$21,NA())","v":{"$error":"#N/A"}},{"$f":"IF(AT$55<=$D$6,OFFSET($E$57,0,0,$D$50+1),NA())","v":{"$error":"#N/A"}},{"$f":"IF(AU$55<=$D$6,OFFSET($F57,0,0,$D$50+1)*$D$49*$G$43,NA())","v":{"$error":"#N/A"}},{"$f":"IF(AV$55<=$D$6,OFFSET($E57,0,0,$D$50+1)/($D$48*$G43),NA())","v":{"$error":"#N/A"}},{"$f":"IF(AW$55<=$D$6,OFFSET($F57,0,0,$D$50+1)*$D$49*$G$43/$D$21,NA())","v":{"$error":"#N/A"}},{"$f":"IF(AX$55<=$D$6,OFFSET($E$57,0,0,$D$50+1),NA())","v":{"$error":"#N/A"}},{"$f":"IF(AY$55<=$D$6,OFFSET($F57,0,0,$D$50+1)*$D$49*$G$44,NA())","v":{"$error":"#N/A"}},{"$f":"IF(AZ$55<=$D$6,OFFSET($E57,0,0,$D$50+1)/($D$48*$G44),NA())","v":{"$error":"#N/A"}},{"$f":"IF(BA$55<=$D$6,OFFSET($F57,0,0,$D$50+1)*$D$49*$G$44/$D$21,NA())","v":{"$error":"#N/A"}},{"$f":"IF(BB$55<=$D$6,OFFSET($E$57,0,0,$D$50+1),NA())","v":{"$error":"#N/A"}},{"$f":"IF(BC$55<=$D$6,OFFSET($F57,0,0,$D$50+1)*$D$49*$G$45,NA())","v":{"$error":"#N/A"}},{"$f":"IF(BD$55<=$D$6,OFFSET($E57,0,0,$D$50+1)/($D$48*$G45),NA())","v":{"$error":"#N/A"}},{"$f":"IF(BE$55<=$D$6,OFFSET($F57,0,0,$D$50+1)*$D$49*$G$45/$D$21,NA())","v":{"$error":"#N/A"}},{"$f":"IF(BF$55<=$D$6,OFFSET($E$57,0,0,$D$50+1),NA())","v":{"$error":"#N/A"}},{"$f":"IF(BG$55<=$D$6,OFFSET($F57,0,0,$D$50+1)*$D$49*$G$46,NA())","v":{"$error":"#N/A"}},{"$f":"IF(BH$55<=$D$6,OFFSET($E57,0,0,$D$50+1)/($D$48*$G46),NA())","v":{"$error":"#N/A"}},{"$f":"IF(BI$55<=$D$6,OFFSET($F57,0,0,$D$50+1)*$D$49*$G$46/$D$21,NA())","v":{"$error":"#N/A"}},{"$f":"IF(BJ$55<=$D$6,OFFSET($E$57,0,0,$D$50+1),NA())","v":{"$error":"#N/A"}},{"$f":"IF(BK$55<=$D$6,OFFSET($F57,0,0,$D$50+1)*$D$49*$G$47,NA())","v":{"$error":"#N/A"}},{"$f":"IF(BL$55<=$D$6,OFFSET($E57,0,0,$D$50+1)/($D$48*$G47),NA())","v":{"$error":"#N/A"}},{"$f":"IF(BM$55<=$D$6,OFFSET($F57,0,0,$D$50+1)*$D$49*$G$47/$D$21,NA())","v":{"$error":"#N/A"}},{"$f":"IF(BN$55<=$D$6,OFFSET($E$57,0,0,$D$50+1),NA())","v":{"$error":"#N/A"}},{"$f":"IF(BO$55<=$D$6,OFFSET($F57,0,0,$D$50+1)*$D$49*$G$48,NA())","v":{"$error":"#N/A"}},{"$f":"IF(BP$55<=$D$6,OFFSET($E57,0,0,$D$50+1)/($D$48*$G48),NA())","v":{"$error":"#N/A"}},{"$f":"IF(BQ$55<=$D$6,OFFSET($F57,0,0,$D$50+1)*$D$49*$G$48/$D$21,NA())","v":{"$error":"#N/A"}},{"$f":"IF(BR$55<=$D$6,OFFSET($E$57,0,0,$D$50+1),NA())","v":{"$error":"#N/A"}},{"$f":"IF(BS$55<=$D$6,OFFSET($F57,0,0,$D$50+1)*$D$49*$G$49,NA())","v":{"$error":"#N/A"}},{"$f":"IF(BT$55<=$D$6,OFFSET($E57,0,0,$D$50+1)/($D$48*$G49),NA())","v":{"$error":"#N/A"}},{"$f":"IF(BU$55<=$D$6,OFFSET($F57,0,0,$D$50+1)*$D$49*$G$49/$D$21,NA())","v":{"$error":"#N/A"}},{"$f":"IF(BV$55<=$D$6,OFFSET($E$57,0,0,$D$50+1),NA())","v":{"$error":"#N/A"}},{"$f":"IF(BW$55<=$D$6,OFFSET($F57,0,0,$D$50+1)*$D$49*$G$50,NA())","v":{"$error":"#N/A"}},{"$f":"IF(BX$55<=$D$6,OFFSET($E57,0,0,$D$50+1)/($D$48*$G50),NA())","v":{"$error":"#N/A"}},{"$f":"IF(BY$55<=$D$6,OFFSET($F57,0,0,$D$50+1)*$D$49*$G$50/$D$21,NA())","v":{"$error":"#N/A"}},{"$f":"IF(BZ$55<=$D$6,OFFSET($E$57,0,0,$D$50+1),NA())","v":{"$error":"#N/A"}},{"$f":"IF(CA$55<=$D$6,OFFSET($F57,0,0,$D$50+1)*$D$49*$G$51,NA())","v":{"$error":"#N/A"}},{"$f":"IF(CB$55<=$D$6,OFFSET($E57,0,0,$D$50+1)/($D$48*$G51),NA())","v":{"$error":"#N/A"}},{"$f":"IF(CC$55<=$D$6,OFFSET($F57,0,0,$D$50+1)*$D$49*$G$51/$D$21,NA())","v":{"$error":"#N/A"}},{"$f":"IF(CD$55<=$D$6,OFFSET($E$57,0,0,$D$50+1),NA())","v":{"$error":"#N/A"}},{"$f":"IF(CE$55<=$D$6,OFFSET($F57,0,0,$D$50+1)*$D$49*$G$52,NA())","v":{"$error":"#N/A"}},{"$f":"IF(CF$55<=$D$6,OFFSET($E57,0,0,$D$50+1)/($D$48*$G52),NA())","v":{"$error":"#N/A"}},{"$f":"IF(CG$55<=$D$6,OFFSET($F57,0,0,$D$50+1)*$D$49*$G$52/$D$21,NA())","v":{"$error":"#N/A"}}]
[null,null,null,null,1000,106,1829.7720000000002,8.3825816241551383,4767.1541233205417,1000,1267.1951410561182,12.104065622292611,3301.4575268052135,1000,906.11346744859645,16.927475084088989,2360.7217470503701,1000,665.56049169490404,23.045558345167972,1734.0026201639378,1000,500.18134913400587,30.665304034525814,1303.1358994083457,1000,383.38080000000002,40.007775933467698,998.83229250525642]
[null,null,null,null,1250,135,2330.3700000000003,10.478227030193922,6071.3755344176716,1250,1613.8806041752448,15.130082027865763,4204.6864728179607,1250,1154.0124349581181,21.159343855111235,3006.5795835075469,1250,847.64779602652868,28.806947931459966,2208.3995634163357,1250,637.02341634991319,38.331630043157269,1659.654211510629,1250,488.26800000000003,50.009719916834626,1272.0977310208455]
[null,null,null,null,1500,162,2796.4440000000004,12.573872436232707,7285.6506413012057,1500,1936.6567250102939,18.156098433438917,5045.6237673815531,1500,1384.8149219497418,25.391212626133484,3607.8955002090565,1500,1017.1773552318344,34.568337517751957,2650.0794760996027,1500,764.42809961989576,45.997956051788726,1991.5850538127547,1500,585.92160000000001,60.011663900201548,1526.5172772250144]
[null,null,null,null,1750,190,3279.7800000000007,14.669517842271491,8544.8989002915387,1750,2271.3875169873818,21.182114839012069,5917.7068876697222,1750,1624.1656492003144,29.62308139715573,4231.4823767883991,1750,1192.9857870002998,40.329727104043947,3108.117904067436,1750,896.55147486284079,53.664282060420177,2335.8096310149595,1750,687.19200000000012,70.013607883568469,1790.3597695848937]
[null,null,null,null,2000,220,3797.6400000000003,16.765163248310277,9894.0934634954647,2000,2630.027651248547,24.208131244585221,6852.0816594070466,2000,1880.6128569687851,33.854950168177979,4899.6111731234096,2000,1381.3519638950838,46.091116690335944,3598.8733626043991,2000,1038.1122340517104,61.330608069051628,2704.6216780173213,2000,795.69600000000003,80.015551866935397,2073.0481542561924]
[null,null,null,null,2250,250,4315.5,18.860808654349061,11243.288026699391,2250,2988.6677855097128,27.234147650158373,7786.4564311443719,2250,2137.0600647372557,38.086818939200228,5567.7399694584201,2250,1569.7181407898679,51.852506276627935,4089.6288211413626,2250,1179.6729932405799,68.996934077683079,3073.4337250196832,2250,904.2,90.017495850302325,2355.7365389274914]
[null,null,null,null,2500,270,4660.7400000000007,20.956454060387845,12142.751068835343,2500,3227.7612083504896,30.260164055731526,8409.3729456359215,2500,2308.0248699162362,42.31868771022247,6013.1591670150938,2500,1695.2955920530574,57.613895862919932,4416.7991268326714,2500,1274.0468326998264,76.663260086314537,3319.308423021258,2500,976.53600000000006,100.01943983366925,2544.1954620416909]
[null,null,null,null,2750,280,4833.3600000000006,23.052099466426629,12592.482589903319,2750,3347.3079197708785,33.286180461304681,8720.8312028816963,2750,2393.5072725057266,46.550556481244719,6235.8687657934306,2750,1758.0843176846524,63.375285449211923,4580.3842796783265,2750,1321.2337524294496,84.329586094945995,3442.2457720220455,2750,1012.7040000000002,110.02138381703617,2638.4249235987909]
[null,null,null,null,3000,275,4747.05,25.147744872465413,12367.61682936933,3000,3287.5345640606838,36.312196866877834,8565.102074258808,3000,2350.766071210981,50.782425252266968,6124.5139664042608,3000,1726.6899548688548,69.136675035503913,4498.5917032554989,3000,1297.6402925646378,91.995912103577453,3380.7770975216513,3000,994.62,120.0233278004031,2591.3101928202404]
[null,null,null,null,3250,260,4488.1200000000008,27.243390278504197,11693.019547767368,3250,3108.2144969301016,39.338213272450986,8097.9146883901476,3250,2222.5424673267462,55.014294023289217,5790.4495682367569,3250,1632.5068664214627,74.898064621795911,4253.2139739870172,3250,1226.8599129702031,99.662238112208897,3196.3710740204706,3250,940.36800000000017,130.02527178377002,2449.9660004845914]
[null,null,null,null,3500,245,4229.1900000000005,29.339035684542981,11018.422266165404,3500,2928.8944297995185,42.364229678024138,7630.7273025214845,3500,2094.3188634425105,59.246162794311459,5456.3851700692512,3500,1538.3237779740707,80.659454208087894,4007.8362447185355,3500,1156.0795333757683,107.32856412084035,3011.9650505192894,3500,886.1160000000001,140.02721576713694,2308.6218081489419]
[null,null,null,null,3750,222,3832.1640000000007,31.434681090581766,9984.0397677090605,3750,2653.9369935326249,45.39024608359729,6914.3733108562019,3750,1897.7093374866831,63.478031565333708,4944.1530928790771,3750,1393.9097090214027,86.420843794379891,3631.5903931735297,3750,1047.5496179976351,114.99489012947181,2729.2091478174789,3750,802.92960000000005,150.02915975050388,2091.8940465676123]
[null,null,null,null,4000,198,3417.8760000000007,33.530326496620553,8904.6841171459182,4000,2367.0248861236928,48.416262489170443,6166.8734934663426,4000,1692.5515712719066,67.709900336355958,4409.6500558110683,4000,1243.2167675055755,92.182233380671889,3238.9860263439591,4000,934.30101064653934,122.66121613810326,2434.1595102155893,4000,716.1264000000001,160.03110373387079,1865.7433388305733]
[null,"Vitesse Maximum","RPM","Traction",4700,140,2416.6800000000003,39.398133633529149,6296.2412949516593,4700,1673.6539598854392,56.889108424775273,4360.4156014408481,4700,1196.7536362528633,79.559132895218255,3117.9343828967153,4700,879.04215884232622,108.31412422228946,2290.1921398391632,4700,660.61687621472481,144.12692896227134,1721.1228860110227,4700,506.35200000000009,188.03654688729819,1319.2124617993954]
[null,{"$f":"$B$73","v":188.30650152172325},0,null,4800,130,2244.0600000000004,40.236391795944662,5846.5097738836839,4800,1554.1072484650508,58.099514987004532,4048.9573441950738,4800,1111.2712336633731,81.251880403627155,2895.2247841183785,4800,816.25343321073137,110.61868005680627,2126.6069869935086,4800,613.42995648510157,147.19345936572392,1598.1855370102353,4800,470.18400000000008,192.03732448064497,1224.9830002422957]
[null,{"$f":"INDEX(D90:D117,MATCH(TRUE,D90:D117<>\"\",0))","v":188.30650152172325},{"$f":"(1000*B73/60)*($D$10*OFFSET($G$33,$D$6-1,0)*$D$9)/($D$24*$D$20)","v":4706.7475541473232},{"$f":"INDEX(E90:E117,MATCH(TRUE,E90:E117<>\"\",0))","v":1312.8542778580988},4900,50,863.10000000000014,41.074649958360176,2248.6576053398785,4900,597.73355710194255,59.309921549233792,1557.2912862288742,4900,427.41201294745116,82.944627912036054,1113.547993891684,4900,313.94362815797365,112.92323589132306,817.92576422827267,4900,235.93459864811601,150.25998976917649,614.68674500393672,4900,180.84000000000003,196.03810207399172,471.14730778549836]
[null,null,null,null,4900,0,0,41.074649958360176,0,4900,0,59.309921549233792,0,4900,0,82.944627912036054,0,4900,0,112.92323589132306,0,4900,0,150.25998976917649,0,4900,0,196.03810207399172,0]
[]
[]
[]
["Vitesse","Frottements"]
[]
[0,{"$f":"(0.5*$D$30*$D$29*$D$28*(A80/3.6)^2)+$D$38","v":156.96}]
[5,157.77481481481482]
[10,160.21925925925927]
[15,164.29333333333335]
[20,169.99703703703705]
[25,177.33037037037039]
[30,186.29333333333335]
[35,196.88592592592593]
[40,209.10814814814816,null,"Intersection dernier rapport / frottements",null,null,null,null,null,"Intersection 1-2",null,null,null,"Intersection 2-3",null,null,null,"Intersection 3-4",null,null,null,"Intersection 4-5",null,null,null,"Intersection 5-6",null,null,null,"Intersection 6-7",null,null,null,"Intersection 7-8",null,null,null,"Intersection 8-9",null,null,null,"Intersection 9-10",null,null,null,"Intersection 10-11",null,null,null,"Intersection 11-12",null,null,null,"Intersection 12-13",null,null,null,"Intersection 13-14",null,null,null,"Intersection 14-15",null,null,null,"Intersection 15-16",null,null,null,"Intersection 16-17",null,null,null,"Intersection 17-18",null,null,null,"Intersection 18-19",null,null,null,"Intersection 19-20"]
[45,222.96000000000004,null,null,null,null,null,null,null,{"$f":"Intersectcomplex(H57,I57,H58,I58,LIGNE2,TRUE)","v":{"$error":"#N/A"}},{"$f":"Intersectcomplex(H57,I57,H58,I58,LIGNE2,FALSE)","v":{"$error":"#N/A"}},null,null,{"$f":"Intersectcomplex(L57,M57,L58,M58,LIGNE3,TRUE)","v":{"$error":"#N/A"}},{"$f":"Intersectcomplex(L57,M57,L58,M58,LIGNE3,FALSE)","v":{"$error":"#N/A"}},null,null,{"$f":"Intersectcomplex(P57,Q57,P58,Q58,LIGNE4,TRUE)","v":{"$error":"#N/A"}},{"$f":"Intersectcomplex(P57,Q57,P58,Q58,LIGNE4,FALSE)","v":{"$error":"#N/A"}},null,null,{"$f":"Intersectcomplex(T57,U57,T58,U58,LIGNE5,TRUE)","v":{"$error":"#N/A"}},{"$f":"Intersectcomplex(T57,U57,T58,U58,LIGNE5,FALSE)","v":{"$error":"#N/A"}},null,null,{"$f":"Intersectcomplex(X57,Y57,X58,Y58,LIGNE6,TRUE)","v":{"$error":"#N/A"}},{"$f":"Intersectcomplex(X57,Y57,X58,Y58,LIGNE6,FALSE)","v":{"$error":"#N/A"}},null,null,{"$f":"Intersectcomplex(AB57,AC57,AB58,AC58,LIGNE7,TRUE)","v":{"$error":"#VALUE!"}},{"$f":"Intersectcomplex(AB57,AC57,AB58,AC58,LIGNE7,FALSE)","v":{"$error":"#VALUE!"}},null,null,{"$f":"Intersectcomplex(AF57,AG57,AF58,AG58,LIGNE8,TRUE)","v":{"$error":"#VALUE!"}},{"$f":"Intersectcomplex(AF57,AG57,AF58,AG58,LIGNE8,FALSE)","v":{"$error":"#VALUE!"}},null,null,{"$f":"Intersectcomplex(AJ57,AK57,AJ58,AK58,LIGNE9,TRUE)","v":{"$error":"#VALUE!"}},{"$f":"Intersectcomplex(AJ57,AK57,AJ58,AK58,LIGNE9,FALSE)","v":{"$error":"#VALUE!"}},null,null,{"$f":"Intersectcomplex(AN57,AO57,AN58,AO58,LIGNE10,TRUE)","v":{"$error":"#VALUE!"}},{"$f":"Intersectcomplex(AN57,AO57,AN58,AO58,LIGNE10,FALSE)","v":{"$error":"#VALUE!"}},null,null,{"$f":"Intersectcomplex(AR57,AS57,AR58,AS58,LIGNE11,TRUE)","v":{"$error":"#VALUE!"}},{"$f":"Intersectcomplex(AR57,AS57,AR58,AS58,LIGNE11,FALSE)","v":{"$error":"#VALUE!"}},null,null,{"$f":"Intersectcomplex(AV57,AW57,AV58,AW58,LIGNE12,TRUE)","v":{"$error":"#VALUE!"}},{"$f":"Intersectcomplex(AV57,AW57,AV58,AW58,LIGNE12,FALSE)","v":{"$error":"#VALUE!"}},null,null,{"$f":"Intersectcomplex(AZ57,BA57,AZ58,BA58,LIGNE13,TRUE)","v":{"$error":"#VALUE!"}},{"$f":"Intersectcomplex(AZ57,BA57,AZ58,BA58,LIGNE13,FALSE)","v":{"$error":"#VALUE!"}},null,null,{"$f":"Intersectcomplex(BD57,BE57,BD58,BE58,LIGNE14,TRUE)","v":{"$error":"#VALUE!"}},{"$f":"Intersectcomplex(BD57,BE57,BD58,BE58,LIGNE14,FALSE)","v":{"$error":"#VALUE!"}},null,null,{"$f":"Intersectcomplex(BH57,BI57,BH58,BI58,LIGNE15,TRUE)","v":{"$error":"#VALUE!"}},{"$f":"Intersectcomplex(BH57,BI57,BH58,BI58,LIGNE15,FALSE)","v":{"$error":"#VALUE!"}},null,null,{"$f":"Intersectcomplex(BL57,BM57,BL58,BM58,LIGNE16,TRUE)","v":{"$error":"#VALUE!"}},{"$f":"Intersectcomplex(BL57,BM57,BL58,BM58,LIGNE16,FALSE)","v":{"$error":"#VALUE!"}},null,null,{"$f":"Intersectcomplex(BP57,BQ57,BP58,BQ58,LIGNE17,TRUE)","v":{"$error":"#VALUE!"}},{"$f":"Intersectcomplex(BP57,BQ57,BP58,BQ58,LIGNE17,FALSE)","v":{"$error":"#VALUE!"}},null,null,{"$f":"Intersectcomplex(BT57,BU57,BT58,BU58,LIGNE18,TRUE)","v":{"$error":"#VALUE!"}},{"$f":"Intersectcomplex(BT57,BU57,BT58,BU58,LIGNE18,FALSE)","v":{"$error":"#VALUE!"}},null,null,{"$f":"Intersectcomplex(BX57,BY57,BX58,BY58,LIGNE19,TRUE)","v":{"$error":"#VALUE!"}},{"$f":"Intersectcomplex(BX57,BY57,BX58,BY58,LIGNE19,FALSE)","v":{"$error":"#VALUE!"}},null,null,{"$f":"Intersectcomplex(CB57,CC57,CB58,CC58,LIGNE20,TRUE)","v":{"$error":"#VALUE!"}},{"$f":"Intersectcomplex(CB57,CC57,CB58,CC58,LIGNE20,FALSE)","v":{"$error":"#VALUE!"}}]
[50,238.4414814814815,null,{"$f":"Intersectcomplex(OFFSET(H57,0,($D$6-1)*4),OFFSET(I57,0,($D$6-1)*4),OFFSET(H58,0,($D$6-1)*4),OFFSET(I58,0,($D$6-1)*4),frottements,TRUE)","v":{"$error":"#N/A"}},{"$f":"Intersectcomplex(OFFSET(H57,0,($D$6-1)*4),OFFSET(I57,0,($D$6-1)*4),OFFSET(H58,0,($D$6-1)*4),OFFSET(I58,0,($D$6-1)*4),frottements,FALSE)","v":{"$error":"#N/A"}},null,null,null,null,{"$error":"#N/A"},{"$error":"#N/A"},null,null,{"$error":"#N/A"},{"$error":"#N/A"},null,null,{"$error":"#N/A"},{"$error":"#N/A"},null,null,{"$error":"#N/A"},{"$error":"#N/A"},null,null,{"$error":"#N/A"},{"$error":"#N/A"},null,null,{"$error":"#VALUE!"},{"$error":"#VALUE!"},null,null,{"$error":"#VALUE!"},{"$error":"#VALUE!"},null,null,{"$error":"#VALUE!"},{"$error":"#VALUE!"},null,null,{"$error":"#VALUE!"},{"$error":"#VALUE!"},null,null,{"$error":"#VALUE!"},{"$error":"#VALUE!"},null,null,{"$error":"#VALUE!"},{"$error":"#VALUE!"},null,null,{"$error":"#VALUE!"},{"$error":"#VALUE!"},null,null,{"$error":"#VALUE!"},{"$error":"#VALUE!"},null,null,{"$error":"#VALUE!"},{"$error":"#VALUE!"},null,null,{"$error":"#VALUE!"},{"$error":"#VALUE!"},null,null,{"$error":"#VALUE!"},{"$error":"#VALUE!"},null,null,{"$error":"#VALUE!"},{"$error":"#VALUE!"},null,null,{"$error":"#VALUE!"},{"$error":"#VALUE!"},null,null,{"$error":"#VALUE!"},{"$error":"#VALUE!"}]
[55,255.55259259259259,null,{"$error":"#N/A"},{"$error":"#N/A"},null,null,null,null,{"$error":"#N/A"},{"$error":"#N/A"},null,null,{"$error":"#N/A"},{"$error":"#N/A"},null,null,{"$error":"#N/A"},{"$error":"#N/A"},null,null,{"$error":"#N/A"},{"$error":"#N/A"},null,null,{"$error":"#N/A"},{"$error":"#N/A"},null,null,{"$error":"#VALUE!"},{"$error":"#VALUE!"},null,null,{"$error":"#VALUE!"},{"$error":"#VALUE!"},null,null,{"$error":"#VALUE!"},{"$error":"#VALUE!"},null,null,{"$error":"#VALUE!"},{"$error":"#VALUE!"},null,null,{"$error":"#VALUE!"},{"$error":"#VALUE!"},null,null,{"$error":"#VALUE!"},{"$error":"#VALUE!"},null,null,{"$error":"#VALUE!"},{"$error":"#VALUE!"},null,null,{"$error":"#VALUE!"},{"$error":"#VALUE!"},null,null,{"$error":"#VALUE!"},{"$error":"#VALUE!"},null,null,{"$error":"#VALUE!"},{"$error":"#VALUE!"},null,null,{"$error":"#VALUE!"},{"$error":"#VALUE!"},null,null,{"$error":"#VALUE!"},{"$error":"#VALUE!"},null,null,{"$error":"#VALUE!"},{"$error":"#VALUE!"},null,null,{"$error":"#VALUE!"},{"$error":"#VALUE!"}]
[60,274.29333333333341,null,{"$error":"#N/A"},{"$error":"#N/A"},null,null,null,null,{"$error":"#N/A"},{"$error":"#N/A"},null,null,{"$error":"#N/A"},{"$error":"#N/A"},null,null,{"$error":"#N/A"},{"$error":"#N/A"},null,null,{"$error":"#N/A"},{"$error":"#N/A"},null,null,{"$error":"#N/A"},{"$error":"#N/A"},null,null,{"$error":"#VALUE!"},{"$error":"#VALUE!"},null,null,{"$error":"#VALUE!"},{"$error":"#VALUE!"},null,null,{"$error":"#VALUE!"},{"$error":"#VALUE!"},null,null,{"$error":"#VALUE!"},{"$error":"#VALUE!"},null,null,{"$error":"#VALUE!"},{"$error":"#VALUE!"},null,null,{"$error":"#VALUE!"},{"$error":"#VALUE!"},null,null,{"$error":"#VALUE!"},{"$error":"#VALUE!"},null,null,{"$error":"#VALUE!"},{"$error":"#VALUE!"},null,null,{"$error":"#VALUE!"},{"$error":"#VALUE!"},null,null,{"$error":"#VALUE!"},{"$error":"#VALUE!"},null,null,{"$error":"#VALUE!"},{"$error":"#VALUE!"},null,null,{"$error":"#VALUE!"},{"$error":"#VALUE!"},null,null,{"$error":"#VALUE!"},{"$error":"#VALUE!"},null,null,{"$error":"#VALUE!"},{"$error":"#VALUE!"}]
[65,294.66370370370373,null,{"$error":"#N/A"},{"$error":"#N/A"},null,null,null,null,{"$error":"#N/A"},{"$error":"#N/A"},null,null,{"$error":"#N/A"},{"$error":"#N/A"},null,null,{"$error":"#N/A"},{"$error":"#N/A"},null,null,{"$error":"#N/A"},{"$error":"#N/A"},null,null,{"$error":"#N/A"},{"$error":"#N/A"},null,null,{"$error":"#VALUE!"},{"$error":"#VALUE!"},null,null,{"$error":"#VALUE!"},{"$error":"#VALUE!"},null,null,{"$error":"#VALUE!"},{"$error":"#VALUE!"},null,null,{"$error":"#VALUE!"},{"$error":"#VALUE!"},null,null,{"$error":"#VALUE!"},{"$error":"#VALUE!"},null,null,{"$error":"#VALUE!"},{"$error":"#VALUE!"},null,null,{"$error":"#VALUE!"},{"$error":"#VALUE!"},null,null,{"$error":"#VALUE!"},{"$error":"#VALUE!"},null,null,{"$error":"#VALUE!"},{"$error":"#VALUE!"},null,null,{"$error":"#VALUE!"},{"$error":"#VALUE!"},null,null,{"$error":"#VALUE!"},{"$error":"#VALUE!"},null,null,{"$error":"#VALUE!"},{"$error":"#VALUE!"},null,null,{"$error":"#VALUE!"},{"$error":"#VALUE!"},null,null,{"$error":"#VALUE!"},{"$error":"#VALUE!"}]
[70,316.66370370370373,null,{"$error":"#N/A"},{"$error":"#N/A"},null,null,null,null,{"$error":"#N/A"},{"$error":"#N/A"},null,null,{"$error":"#N/A"},{"$error":"#N/A"},null,null,{"$error":"#N/A"},{"$error":"#N/A"},null,null,{"$error":"#N/A"},{"$error":"#N/A"},null,null,{"$error":"#N/A"},{"$error":"#N/A"},null,null,{"$error":"#VALUE!"},{"$error":"#VALUE!"},null,null,{"$error":"#VALUE!"},{"$error":"#VALUE!"},null,null,{"$error":"#VALUE!"},{"$error":"#VALUE!"},null,null,{"$error":"#VALUE!"},{"$error":"#VALUE!"},null,null,{"$error":"#VALUE!"},{"$error":"#VALUE!"},null,null,{"$error":"#VALUE!"},{"$error":"#VALUE!"},null,null,{"$error":"#VALUE!"},{"$error":"#VALUE!"},null,null,{"$error":"#VALUE!"},{"$error":"#VALUE!"},null,null,{"$error":"#VALUE!"},{"$error":"#VALUE!"},null,null,{"$error":"#VALUE!"},{"$error":"#VALUE!"},null,null,{"$error":"#VALUE!"},{"$error":"#VALUE!"},null,null,{"$error":"#VALUE!"},{"$error":"#VALUE!"},null,null,{"$error":"#VALUE!"},{"$error":"#VALUE!"},null,null,{"$error":"#VALUE!"},{"$error":"#VALUE!"}]
[75,340.29333333333335,null,{"$error":"#N/A"},{"$error":"#N/A"},null,null,null,null,{"$error":"#N/A"},{"$error":"#N/A"},null,null,{"$error":"#N/A"},{"$error":"#N/A"},null,null,{"$error":"#N/A"},{"$error":"#N/A"},null,null,{"$error":"#N/A"},{"$error":"#N/A"},null,null,{"$error":"#N/A"},{"$error":"#N/A"},null,null,{"$error":"#VALUE!"},{"$error":"#VALUE!"},null,null,{"$error":"#VALUE!"},{"$error":"#VALUE!"},null,null,{"$error":"#VALUE!"},{"$error":"#VALUE!"},null,null,{"$error":"#VALUE!"},{"$error":"#VALUE!"},null,null,{"$error":"#VALUE!"},{"$error":"#VALUE!"},null,null,{"$error":"#VALUE!"},{"$error":"#VALUE!"},null,null,{"$error":"#VALUE!"},{"$error":"#VALUE!"},null,null,{"$error":"#VALUE!"},{"$error":"#VALUE!"},null,null,{"$error":"#VALUE!"},{"$error":"#VALUE!"},null,null,{"$error":"#VALUE!"},{"$error":"#VALUE!"},null,null,{"$error":"#VALUE!"},{"$error":"#VALUE!"},null,null,{"$error":"#VALUE!"},{"$error":"#VALUE!"},null,null,{"$error":"#VALUE!"},{"$error":"#VALUE!"},null,null,{"$error":"#VALUE!"},{"$error":"#VALUE!"}]
[80,365.55259259259265,null,{"$error":"#N/A"},{"$error":"#N/A"},null,null,null,null,{"$error":"#N/A"},{"$error":"#N/A"},null,null,{"$error":"#N/A"},{"$error":"#N/A"},null,null,{"$error":"#N/A"},{"$error":"#N/A"},null,null,{"$error":"#N/A"},{"$error":"#N/A"},null,null,{"$error":"#N/A"},{"$error":"#N/A"},null,null,{"$error":"#VALUE!"},{"$error":"#VALUE!"},null,null,{"$error":"#VALUE!"},{"$error":"#VALUE!"},null,null,{"$error":"#VALUE!"},{"$error":"#VALUE!"},null,null,{"$error":"#VALUE!"},{"$error":"#VALUE!"},null,null,{"$error":"#VALUE!"},{"$error":"#VALUE!"},null,null,{"$error":"#VALUE!"},{"$error":"#VALUE!"},null,null,{"$error":"#VALUE!"},{"$error":"#VALUE!"},null,null,{"$error":"#VALUE!"},{"$error":"#VALUE!"},null,null,{"$error":"#VALUE!"},{"$error":"#VALUE!"},null,null,{"$error":"#VALUE!"},{"$error":"#VALUE!"},null,null,{"$error":"#VALUE!"},{"$error":"#VALUE!"},null,null,{"$error":"#VALUE!"},{"$error":"#VALUE!"},null,null,{"$error":"#VALUE!"},{"$error":"#VALUE!"},null,null,{"$error":"#VALUE!"},{"$error":"#VALUE!"}]
[85,392.4414814814815,null,{"$error":"#N/A"},{"$error":"#N/A"},null,null,null,null,{"$error":"#N/A"},{"$error":"#N/A"},null,null,{"$error":"#N/A"},{"$error":"#N/A"},null,null,{"$error":"#N/A"},{"$error":"#N/A"},null,null,{"$error":"#N/A"},{"$error":"#N/A"},null,null,{"$error":"#N/A"},{"$error":"#N/A"},null,null,{"$error":"#VALUE!"},{"$error":"#VALUE!"},null,null,{"$error":"#VALUE!"},{"$error":"#VALUE!"},null,null,{"$error":"#VALUE!"},{"$error":"#VALUE!"},null,null,{"$error":"#VALUE!"},{"$error":"#VALUE!"},null,null,{"$error":"#VALUE!"},{"$error":"#VALUE!"},null,null,{"$error":"#VALUE!"},{"$error":"#VALUE!"},null,null,{"$error":"#VALUE!"},{"$error":"#VALUE!"},null,null,{"$error":"#VALUE!"},{"$error":"#VALUE!"},null,null,{"$error":"#VALUE!"},{"$error":"#VALUE!"},null,null,{"$error":"#VALUE!"},{"$error":"#VALUE!"},null,null,{"$error":"#VALUE!"},{"$error":"#VALUE!"},null,null,{"$error":"#VALUE!"},{"$error":"#VALUE!"},null,null,{"$error":"#VALUE!"},{"$error":"#VALUE!"},null,null,{"$error":"#VALUE!"},{"$error":"#VALUE!"}]
[90,420.96000000000004,null,{"$error":"#N/A"},{"$error":"#N/A"},null,null,null,null,{"$error":"#N/A"},{"$error":"#N/A"},null,null,{"$error":"#N/A"},{"$error":"#N/A"},null,null,{"$error":"#N/A"},{"$error":"#N/A"},null,null,{"$error":"#N/A"},{"$error":"#N/A"},null,null,{"$error":"#N/A"},{"$error":"#N/A"},null,null,{"$error":"#VALUE!"},{"$error":"#VALUE!"},null,null,{"$error":"#VALUE!"},{"$error":"#VALUE!"},null,null,{"$error":"#VALUE!"},{"$error":"#VALUE!"},null,null,{"$error":"#VALUE!"},{"$error":"#VALUE!"},null,null,{"$error":"#VALUE!"},{"$error":"#VALUE!"},null,null,{"$error":"#VALUE!"},{"$error":"#VALUE!"},null,null,{"$error":"#VALUE!"},{"$error":"#VALUE!"},null,null,{"$error":"#VALUE!"},{"$error":"#VALUE!"},null,null,{"$error":"#VALUE!"},{"$error":"#VALUE!"},null,null,{"$error":"#VALUE!"},{"$error":"#VALUE!"},null,null,{"$error":"#VALUE!"},{"$error":"#VALUE!"},null,null,{"$error":"#VALUE!"},{"$error":"#VALUE!"},null,null,{"$error":"#VALUE!"},{"$error":"#VALUE!"},null,null,{"$error":"#VALUE!"},{"$error":"#VALUE!"}]
[95,451.10814814814819,null,{"$error":"#N/A"},{"$error":"#N/A"},null,null,null,null,{"$error":"#N/A"},{"$error":"#N/A"},null,null,{"$error":"#N/A"},{"$error":"#N/A"},null,null,{"$error":"#N/A"},{"$error":"#N/A"},null,null,{"$error":"#N/A"},{"$error":"#N/A"},null,null,{"$error":"#N/A"},{"$error":"#N/A"},null,null,{"$error":"#VALUE!"},{"$error":"#VALUE!"},null,null,{"$error":"#VALUE!"},{"$error":"#VALUE!"},null,null,{"$error":"#VALUE!"},{"$error":"#VALUE!"},null,null,{"$error":"#VALUE!"},{"$error":"#VALUE!"},null,null,{"$error":"#VALUE!"},{"$error":"#VALUE!"},null,null,{"$error":"#VALUE!"},{"$error":"#VALUE!"},null,null,{"$error":"#VALUE!"},{"$error":"#VALUE!"},null,null,{"$error":"#VALUE!"},{"$error":"#VALUE!"},null,null,{"$error":"#VALUE!"},{"$error":"#VALUE!"},null,null,{"$error":"#VALUE!"},{"$error":"#VALUE!"},null,null,{"$error":"#VALUE!"},{"$error":"#VALUE!"},null,null,{"$error":"#VALUE!"},{"$error":"#VALUE!"},null,null,{"$error":"#VALUE!"},{"$error":"#VALUE!"},null,null,{"$error":"#VALUE!"},{"$error":"#VALUE!"}]
[100,482.88592592592602,null,{"$error":"#N/A"},{"$error":"#N/A"},null,null,null,null,{"$error":"#N/A"},{"$error":"#N/A"},null,null,{"$error":"#N/A"},{"$error":"#N/A"},null,null,{"$error":"#N/A"},{"$error":"#N/A"},null,null,{"$error":"#N/A"},{"$error":"#N/A"},null,null,{"$error":"#N/A"},{"$error":"#N/A"},null,null,{"$error":"#VALUE!"},{"$error":"#VALUE!"},null,null,{"$error":"#VALUE!"},{"$error":"#VALUE!"},null,null,{"$error":"#VALUE!"},{"$error":"#VALUE!"},null,null,{"$error":"#VALUE!"},{"$error":"#VALUE!"},null,null,{"$error":"#VALUE!"},{"$error":"#VALUE!"},null,null,{"$error":"#VALUE!"},{"$error":"#VALUE!"},null,null,{"$error":"#VALUE!"},{"$error":"#VALUE!"},null,null,{"$error":"#VALUE!"},{"$error":"#VALUE!"},null,null,{"$error":"#VALUE!"},{"$error":"#VALUE!"},null,null,{"$error":"#VALUE!"},{"$error":"#VALUE!"},null,null,{"$error":"#VALUE!"},{"$error":"#VALUE!"},null,null,{"$error":"#VALUE!"},{"$error":"#VALUE!"},null,null,{"$error":"#VALUE!"},{"$error":"#VALUE!"},null,null,{"$error":"#VALUE!"},{"$error":"#VALUE!"}]
[105,516.29333333333329,null,{"$error":"#N/A"},{"$error":"#N/A"},null,null,null,null,{"$error":"#N/A"},{"$error":"#N/A"},null,null,48.326089232894901,6189.1484859202092,null,null,66.735861797210745,4532.675268917722,null,null,89.848848948303313,3397.9922702229874,null,null,118.37636186699197,2599.0683203085719,null,null,{"$error":"#VALUE!"},{"$error":"#VALUE!"},null,null,{"$error":"#VALUE!"},{"$error":"#VALUE!"},null,null,{"$error":"#VALUE!"},{"$error":"#VALUE!"},null,null,{"$error":"#VALUE!"},{"$error":"#VALUE!"},null,null,{"$error":"#VALUE!"},{"$error":"#VALUE!"},null,null,{"$error":"#VALUE!"},{"$error":"#VALUE!"},null,null,{"$error":"#VALUE!"},{"$error":"#VALUE!"},null,null,{"$error":"#VALUE!"},{"$error":"#VALUE!"},null,null,{"$error":"#VALUE!"},{"$error":"#VALUE!"},null,null,{"$error":"#VALUE!"},{"$error":"#VALUE!"},null,null,{"$error":"#VALUE!"},{"$error":"#VALUE!"},null,null,{"$error":"#VALUE!"},{"$error":"#VALUE!"},null,null,{"$error":"#VALUE!"},{"$error":"#VALUE!"},null,null,{"$error":"#VALUE!"},{"$error":"#VALUE!"}]
[110,551.33037037037036,null,{"$error":"#N/A"},{"$error":"#N/A"},null,null,null,null,34.030026166126625,8682.5503650024129,null,null,{"$error":"#N/A"},{"$error":"#N/A"},null,null,{"$error":"#N/A"},{"$error":"#N/A"},null,null,{"$error":"#N/A"},{"$error":"#N/A"},null,null,{"$error":"#N/A"},{"$error":"#N/A"},null,null,{"$error":"#VALUE!"},{"$error":"#VALUE!"},null,null,{"$error":"#VALUE!"},{"$error":"#VALUE!"},null,null,{"$error":"#VALUE!"},{"$error":"#VALUE!"},null,null,{"$error":"#VALUE!"},{"$error":"#VALUE!"},null,null,{"$error":"#VALUE!"},{"$error":"#VALUE!"},null,null,{"$error":"#VALUE!"},{"$error":"#VALUE!"},null,null,{"$error":"#VALUE!"},{"$error":"#VALUE!"},null,null,{"$error":"#VALUE!"},{"$error":"#VALUE!"},null,null,{"$error":"#VALUE!"},{"$error":"#VALUE!"},null,null,{"$error":"#VALUE!"},{"$error":"#VALUE!"},null,null,{"$error":"#VALUE!"},{"$error":"#VALUE!"},null,null,{"$error":"#VALUE!"},{"$error":"#VALUE!"},null,null,{"$error":"#VALUE!"},{"$error":"#VALUE!"},null,null,{"$error":"#VALUE!"},{"$error":"#VALUE!"}]
[115,587.9970370370371,null,{"$error":"#N/A"},{"$error":"#N/A"},null,null,null,null,{"$error":"#N/A"},{"$error":"#N/A"},null,null,{"$error":"#N/A"},{"$error":"#N/A"},null,null,{"$error":"#N/A"},{"$error":"#N/A"},null,null,{"$error":"#N/A"},{"$error":"#N/A"},null,null,{"$error":"#N/A"},{"$error":"#N/A"},null,null,{"$error":"#VALUE!"},{"$error":"#VALUE!"},null,null,{"$error":"#VALUE!"},{"$error":"#VALUE!"},null,null,{"$error":"#VALUE!"},{"$error":"#VALUE!"},null,null,{"$error":"#VALUE!"},{"$error":"#VALUE!"},null,null,{"$error":"#VALUE!"},{"$error":"#VALUE!"},null,null,{"$error":"#VALUE!"},{"$error":"#VALUE!"},null,null,{"$error":"#VALUE!"},{"$error":"#VALUE!"},null,null,{"$error":"#VALUE!"},{"$error":"#VALUE!"},null,null,{"$error":"#VALUE!"},{"$error":"#VALUE!"},null,null,{"$error":"#VALUE!"},{"$error":"#VALUE!"},null,null,{"$error":"#VALUE!"},{"$error":"#VALUE!"},null,null,{"$error":"#VALUE!"},{"$error":"#VALUE!"},null,null,{"$error":"#VALUE!"},{"$error":"#VALUE!"},null,null,{"$error":"#VALUE!"},{"$error":"#VALUE!"}]
[120,626.29333333333352,null,188.30650152172325,1312.8542778580988,null,null,null,null,{"$error":"#N/A"},{"$error":"#N/A"},null,null,{"$error":"#N/A"},{"$error":"#N/A"},null,null,{"$error":"#N/A"},{"$error":"#N/A"},null,null,{"$error":"#N/A"},{"$error":"#N/A"},null,null,{"$error":"#N/A"},{"$error":"#N/A"},null,null,{"$error":"#VALUE!"},{"$error":"#VALUE!"},null,null,{"$error":"#VALUE!"},{"$error":"#VALUE!"},null,null,{"$error":"#VALUE!"},{"$error":"#VALUE!"},null,null,{"$error":"#VALUE!"},{"$error":"#VALUE!"},null,null,{"$error":"#VALUE!"},{"$error":"#VALUE!"},null,null,{"$error":"#VALUE!"},{"$error":"#VALUE!"},null,null,{"$error":"#VALUE!"},{"$error":"#VALUE!"},null,null,{"$error":"#VALUE!"},{"$error":"#VALUE!"},null,null,{"$error":"#VALUE!"},{"$error":"#VALUE!"},null,null,{"$error":"#VALUE!"},{"$error":"#VALUE!"},null,null,{"$error":"#VALUE!"},{"$error":"#VALUE!"},null,null,{"$error":"#VALUE!"},{"$error":"#VALUE!"},null,null,{"$error":"#VALUE!"},{"$error":"#VALUE!"},null,null,{"$error":"#VALUE!"},{"$error":"#VALUE!"}]
[125,666.21925925925927,null,{"$error":"#N/A"},{"$error":"#N/A"},null,null,null,null,41.074649958360176,0,null,null,59.309921549233792,0,null,null,82.944627912036054,0,null,null,112.92323589132306,0,null,null,150.25998976917649,0,null,null,{"$error":"#VALUE!"},{"$error":"#VALUE!"},null,null,{"$error":"#VALUE!"},{"$error":"#VALUE!"},null,null,{"$error":"#VALUE!"},{"$error":"#VALUE!"},null,null,{"$error":"#VALUE!"},{"$error":"#VALUE!"},null,null,{"$error":"#VALUE!"},{"$error":"#VALUE!"},null,null,{"$error":"#VALUE!"},{"$error":"#VALUE!"},null,null,{"$error":"#VALUE!"},{"$error":"#VALUE!"},null,null,{"$error":"#VALUE!"},{"$error":"#VALUE!"},null,null,{"$error":"#VALUE!"},{"$error":"#VALUE!"},null,null,{"$error":"#VALUE!"},{"$error":"#VALUE!"},null,null,{"$error":"#VALUE!"},{"$error":"#VALUE!"},null,null,{"$error":"#VALUE!"},{"$error":"#VALUE!"},null,null,{"$error":"#VALUE!"},{"$error":"#VALUE!"},null,null,{"$error":"#VALUE!"},{"$error":"#VALUE!"}]
[130,707.77481481481482,null,{"$error":"#N/A"},{"$error":"#N/A"},null,null,null,null,{"$error":"#N/A"},{"$error":"#N/A"},null,null,{"$error":"#N/A"},{"$error":"#N/A"},null,null,{"$error":"#N/A"},{"$error":"#N/A"},null,null,{"$error":"#N/A"},{"$error":"#N/A"},null,null,{"$error":"#N/A"},{"$error":"#N/A"},null,null,{"$error":"#VALUE!"},{"$error":"#VALUE!"},null,null,{"$error":"#VALUE!"},{"$error":"#VALUE!"},null,null,{"$error":"#VALUE!"},{"$error":"#VALUE!"},null,null,{"$error":"#VALUE!"},{"$error":"#VALUE!"},null,null,{"$error":"#VALUE!"},{"$error":"#VALUE!"},null,null,{"$error":"#VALUE!"},{"$error":"#VALUE!"},null,null,{"$error":"#VALUE!"},{"$error":"#VALUE!"},null,null,{"$error":"#VALUE!"},{"$error":"#VALUE!"},null,null,{"$error":"#VALUE!"},{"$error":"#VALUE!"},null,null,{"$error":"#VALUE!"},{"$error":"#VALUE!"},null,null,{"$error":"#VALUE!"},{"$error":"#VALUE!"},null,null,{"$error":"#VALUE!"},{"$error":"#VALUE!"},null,null,{"$error":"#VALUE!"},{"$error":"#VALUE!"},null,null,{"$error":"#VALUE!"},{"$error":"#VALUE!"}]
[135,750.96000000000015,null,{"$error":"#N/A"},{"$error":"#N/A"},null,null,null,null,0,0,null,null,0,0,null,null,0,0,null,null,0,0,null,null,0,0,null,null,{"$error":"#VALUE!"},{"$error":"#VALUE!"},null,null,{"$error":"#VALUE!"},{"$error":"#VALUE!"},null,null,{"$error":"#VALUE!"},{"$error":"#VALUE!"},null,null,{"$error":"#VALUE!"},{"$error":"#VALUE!"},null,null,{"$error":"#VALUE!"},{"$error":"#VALUE!"},null,null,{"$error":"#VALUE!"},{"$error":"#VALUE!"},null,null,{"$error":"#VALUE!"},{"$error":"#VALUE!"},null,null,{"$error":"#VALUE!"},{"$error":"#VALUE!"},null,null,{"$error":"#VALUE!"},{"$error":"#VALUE!"},null,null,{"$error":"#VALUE!"},{"$error":"#VALUE!"},null,null,{"$error":"#VALUE!"},{"$error":"#VALUE!"},null,null,{"$error":"#VALUE!"},{"$error":"#VALUE!"},null,null,{"$error":"#VALUE!"},{"$error":"#VALUE!"},null,null,{"$error":"#VALUE!"},{"$error":"#VALUE!"}]
[140,795.77481481481482,null,{"$error":"#N/A"},{"$error":"#N/A"},null,null,null,null,0,0,null,null,0,0,null,null,0,0,null,null,0,0,null,null,0,0,null,null,{"$error":"#VALUE!"},{"$error":"#VALUE!"},null,null,{"$error":"#VALUE!"},{"$error":"#VALUE!"},null,null,{"$error":"#VALUE!"},{"$error":"#VALUE!"},null,null,{"$error":"#VALUE!"},{"$error":"#VALUE!"},null,null,{"$error":"#VALUE!"},{"$error":"#VALUE!"},null,null,{"$error":"#VALUE!"},{"$error":"#VALUE!"},null,null,{"$error":"#VALUE!"},{"$error":"#VALUE!"},null,null,{"$error":"#VALUE!"},{"$error":"#VALUE!"},null,null,{"$error":"#VALUE!"},{"$error":"#VALUE!"},null,null,{"$error":"#VALUE!"},{"$error":"#VALUE!"},null,null,{"$error":"#VALUE!"},{"$error":"#VALUE!"},null,null,{"$error":"#VALUE!"},{"$error":"#VALUE!"},null,null,{"$error":"#VALUE!"},{"$error":"#VALUE!"},null,null,{"$error":"#VALUE!"},{"$error":"#VALUE!"}]
[145,842.21925925925939,null,{"$error":"#N/A"},{"$error":"#N/A"},null,null,null,null,0,0,null,null,0,0,null,null,0,0,null,null,0,0,null,null,0,0,null,null,{"$error":"#VALUE!"},{"$error":"#VALUE!"},null,null,{"$error":"#VALUE!"},{"$error":"#VALUE!"},null,null,{"$error":"#VALUE!"},{"$error":"#VALUE!"},null,null,{"$error":"#VALUE!"},{"$error":"#VALUE!"},null,null,{"$error":"#VALUE!"},{"$error":"#VALUE!"},null,null,{"$error":"#VALUE!"},{"$error":"#VALUE!"},null,null,{"$error":"#VALUE!"},{"$error":"#VALUE!"},null,null,{"$error":"#VALUE!"},{"$error":"#VALUE!"},null,null,{"$error":"#VALUE!"},{"$error":"#VALUE!"},null,null,{"$error":"#VALUE!"},{"$error":"#VALUE!"},null,null,{"$error":"#VALUE!"},{"$error":"#VALUE!"},null,null,{"$error":"#VALUE!"},{"$error":"#VALUE!"},null,null,{"$error":"#VALUE!"},{"$error":"#VALUE!"},null,null,{"$error":"#VALUE!"},{"$error":"#VALUE!"}]
[150,890.29333333333341,null,{"$error":"#N/A"},{"$error":"#N/A"},null,null,null,null,0,0,null,null,0,0,null,null,0,0,null,null,0,0,null,null,0,0,null,null,{"$error":"#VALUE!"},{"$error":"#VALUE!"},null,null,{"$error":"#VALUE!"},{"$error":"#VALUE!"},null,null,{"$error":"#VALUE!"},{"$error":"#VALUE!"},null,null,{"$error":"#VALUE!"},{"$error":"#VALUE!"},null,null,{"$error":"#VALUE!"},{"$error":"#VALUE!"},null,null,{"$error":"#VALUE!"},{"$error":"#VALUE!"},null,null,{"$error":"#VALUE!"},{"$error":"#VALUE!"},null,null,{"$error":"#VALUE!"},{"$error":"#VALUE!"},null,null,{"$error":"#VALUE!"},{"$error":"#VALUE!"},null,null,{"$error":"#VALUE!"},{"$error":"#VALUE!"},null,null,{"$error":"#VALUE!"},{"$error":"#VALUE!"},null,null,{"$error":"#VALUE!"},{"$error":"#VALUE!"},null,null,{"$error":"#VALUE!"},{"$error":"#VALUE!"},null,null,{"$error":"#VALUE!"},{"$error":"#VALUE!"}]
[155,939.99703703703722,null,{"$error":"#N/A"},{"$error":"#N/A"},null,null,null,null,0,0,null,null,0,0,null,null,0,0,null,null,0,0,null,null,0,0,null,null,{"$error":"#VALUE!"},{"$error":"#VALUE!"},null,null,{"$error":"#VALUE!"},{"$error":"#VALUE!"},null,null,{"$error":"#VALUE!"},{"$error":"#VALUE!"},null,null,{"$error":"#VALUE!"},{"$error":"#VALUE!"},null,null,{"$error":"#VALUE!"},{"$error":"#VALUE!"},null,null,{"$error":"#VALUE!"},{"$error":"#VALUE!"},null,null,{"$error":"#VALUE!"},{"$error":"#VALUE!"},null,null,{"$error":"#VALUE!"},{"$error":"#VALUE!"},null,null,{"$error":"#VALUE!"},{"$error":"#VALUE!"},null,null,{"$error":"#VALUE!"},{"$error":"#VALUE!"},null,null,{"$error":"#VALUE!"},{"$error":"#VALUE!"},null,null,{"$error":"#VALUE!"},{"$error":"#VALUE!"},null,null,{"$error":"#VALUE!"},{"$error":"#VALUE!"},null,null,{"$error":"#VALUE!"},{"$error":"#VALUE!"}]
[160,991.33037037037047,null,{"$error":"#N/A"},{"$error":"#N/A"},null,null,null,null,0,0,null,null,0,0,null,null,0,0,null,null,0,0,null,null,0,0,null,null,{"$error":"#VALUE!"},{"$error":"#VALUE!"},null,null,{"$error":"#VALUE!"},{"$error":"#VALUE!"},null,null,{"$error":"#VALUE!"},{"$error":"#VALUE!"},null,null,{"$error":"#VALUE!"},{"$error":"#VALUE!"},null,null,{"$error":"#VALUE!"},{"$error":"#VALUE!"},null,null,{"$error":"#VALUE!"},{"$error":"#VALUE!"},null,null,{"$error":"#VALUE!"},{"$error":"#VALUE!"},null,null,{"$error":"#VALUE!"},{"$error":"#VALUE!"},null,null,{"$error":"#VALUE!"},{"$error":"#VALUE!"},null,null,{"$error":"#VALUE!"},{"$error":"#VALUE!"},null,null,{"$error":"#VALUE!"},{"$error":"#VALUE!"},null,null,{"$error":"#VALUE!"},{"$error":"#VALUE!"},null,null,{"$error":"#VALUE!"},{"$error":"#VALUE!"},null,null,{"$error":"#VALUE!"},{"$error":"#VALUE!"}]
[165,1044.2933333333335,null,{"$error":"#N/A"},{"$error":"#N/A"},null,null,null,null,0,0,null,null,0,0,null,null,0,0,null,null,0,0,null,null,0,0,null,null,{"$error":"#VALUE!"},{"$error":"#VALUE!"},null,null,{"$error":"#VALUE!"},{"$error":"#VALUE!"},null,null,{"$error":"#VALUE!"},{"$error":"#VALUE!"},null,null,{"$error":"#VALUE!"},{"$error":"#VALUE!"},null,null,{"$error":"#VALUE!"},{"$error":"#VALUE!"},null,null,{"$error":"#VALUE!"},{"$error":"#VALUE!"},null,null,{"$error":"#VALUE!"},{"$error":"#VALUE!"},null,null,{"$error":"#VALUE!"},{"$error":"#VALUE!"},null,null,{"$error":"#VALUE!"},{"$error":"#VALUE!"},null,null,{"$error":"#VALUE!"},{"$error":"#VALUE!"},null,null,{"$error":"#VALUE!"},{"$error":"#VALUE!"},null,null,{"$error":"#VALUE!"},{"$error":"#VALUE!"},null,null,{"$error":"#VALUE!"},{"$error":"#VALUE!"},null,null,{"$error":"#VALUE!"},{"$error":"#VALUE!"}]
[170,1098.8859259259259,null,{"$error":"#N/A"},{"$error":"#N/A"},null,null,null,null,0,0,null,null,0,0,null,null,0,0,null,null,0,0,null,null,0,0,null,null,{"$error":"#VALUE!"},{"$error":"#VALUE!"},null,null,{"$error":"#VALUE!"},{"$error":"#VALUE!"},null,null,{"$error":"#VALUE!"},{"$error":"#VALUE!"},null,null,{"$error":"#VALUE!"},{"$error":"#VALUE!"},null,null,{"$error":"#VALUE!"},{"$error":"#VALUE!"},null,null,{"$error":"#VALUE!"},{"$error":"#VALUE!"},null,null,{"$error":"#VALUE!"},{"$error":"#VALUE!"},null,null,{"$error":"#VALUE!"},{"$error":"#VALUE!"},null,null,{"$error":"#VALUE!"},{"$error":"#VALUE!"},null,null,{"$error":"#VALUE!"},{"$error":"#VALUE!"},null,null,{"$error":"#VALUE!"},{"$error":"#VALUE!"},null,null,{"$error":"#VALUE!"},{"$error":"#VALUE!"},null,null,{"$error":"#VALUE!"},{"$error":"#VALUE!"},null,null,{"$error":"#VALUE!"},{"$error":"#VALUE!"}]
[175,1155.1081481481481,null,{"$error":"#N/A"},{"$error":"#N/A"},null,null,null,null,0,0,null,null,0,0,null,null,0,0,null,null,0,0,null,null,0,0,null,null,{"$error":"#VALUE!"},{"$error":"#VALUE!"},null,null,{"$error":"#VALUE!"},{"$error":"#VALUE!"},null,null,{"$error":"#VALUE!"},{"$error":"#VALUE!"},null,null,{"$error":"#VALUE!"},{"$error":"#VALUE!"},null,null,{"$error":"#VALUE!"},{"$error":"#VALUE!"},null,null,{"$error":"#VALUE!"},{"$error":"#VALUE!"},null,null,{"$error":"#VALUE!"},{"$error":"#VALUE!"},null,null,{"$error":"#VALUE!"},{"$error":"#VALUE!"},null,null,{"$error":"#VALUE!"},{"$error":"#VALUE!"},null,null,{"$error":"#VALUE!"},{"$error":"#VALUE!"},null,null,{"$error":"#VALUE!"},{"$error":"#VALUE!"},null,null,{"$error":"#VALUE!"},{"$error":"#VALUE!"},null,null,{"$error":"#VALUE!"},{"$error":"#VALUE!"},null,null,{"$error":"#VALUE!"},{"$error":"#VALUE!"}]
[180,1212.9600000000003,null,{"$error":"#N/A"},{"$error":"#N/A"},null,null,null,null,0,0,null,null,0,0,null,null,0,0,null,null,0,0,null,null,0,0,null,null,{"$error":"#VALUE!"},{"$error":"#VALUE!"},null,null,{"$error":"#VALUE!"},{"$error":"#VALUE!"},null,null,{"$error":"#VALUE!"},{"$error":"#VALUE!"},null,null,{"$error":"#VALUE!"},{"$error":"#VALUE!"},null,null,{"$error":"#VALUE!"},{"$error":"#VALUE!"},null,null,{"$error":"#VALUE!"},{"$error":"#VALUE!"},null,null,{"$error":"#VALUE!"},{"$error":"#VALUE!"},null,null,{"$error":"#VALUE!"},{"$error":"#VALUE!"},null,null,{"$error":"#VALUE!"},{"$error":"#VALUE!"},null,null,{"$error":"#VALUE!"},{"$error":"#VALUE!"},null,null,{"$error":"#VALUE!"},{"$error":"#VALUE!"},null,null,{"$error":"#VALUE!"},{"$error":"#VALUE!"},null,null,{"$error":"#VALUE!"},{"$error":"#VALUE!"},null,null,{"$error":"#VALUE!"},{"$error":"#VALUE!"}]
[185,1272.4414814814816,null,{"$error":"#N/A"},{"$error":"#N/A"}]
[190,1333.5525925925926,null,null,null,null,null,null,null,null,null,null,null,null,null,null,null,null,null,null,null,null,null,null,null,"Marques Intersections"]
[195,1396.2933333333333,null,null,null,null,null,null,null,"km/h","RPM","Traction","Vitesse","Changement","km/h","RPM",null,"Milieux",null,null,"Etiquettes",null,null,null,null,"km/h","Traction"]
[200,1460.663703703704,null,null,null,null,null,null,null,0,0,null,1,0,{"$f":"OFFSET(J120,0,0,$D$6*2)","v":0},{"$f":"OFFSET(K120,0,0,$D$6*2)","v":0}]
[205,1526.6637037037037,null,null,null,null,"Vitesse en km/h intersection 1-2",null,null,{"$f":"IF($D$6-1-M121+1-N121>=0,INDEX(J$89:J$116, MATCH(TRUE, J$89:J$116<>\"\", 0)),OFFSET($H$57,$D$50-1,($D$6-1)*4))","v":34.030026166126625},{"$f":"(1000*J121/60)*($D$10*$G$33*$D$9)/($D$24*$D$20)","v":4059.6116676115798},{"$f":"INDEX(K$89:K$116, MATCH(TRUE, K$89:K$116<>\"\", 0))","v":8682.5503650024129},1,1,34.030026166126625,4059.6116676115798,null,{"$f":"(O121-O120)/2+O120","v":17.015013083063312},{"$f":"(P121-P120)/2+P120","v":2029.8058338057899},null,"1st",null,null,null,null,{"$f":"IF(M121<=$D$6-1,J121,NA())","v":34.030026166126625},{"$f":"IF(M121<=$D$6-1,L121,NA())","v":8682.5503650024129}]
[210,1594.2933333333333,null,null,null,null,null,null,null,{"$f":"IF($D$6-1-M122+1-N122>=0,INDEX(J$89:J$116, MATCH(TRUE, J$89:J$116<>\"\", 0)),OFFSET($H$57,$D$50-1,($D$6-1)*4))","v":34.030026166126625},{"$f":"(1000*J122/60)*($D$10*$G$34*$D$9)/($D$24*$D$20)","v":2811.4542029127779},{"$f":"INDEX(K$89:K$116, MATCH(TRUE, K$89:K$116<>\"\", 0))","v":8682.5503650024129},2,0,34.030026166126625,2811.4542029127779,null,null,null,null,null,null,null,null,null,34.030026166126625,8682.5503650024129]
[215,1663.5525925925929,null,null,null,null,"Vitesse en km/h intersection 2-3",null,null,{"$f":"IF($D$6-1-M123+1-N123>=0,INDEX(N$89:N$116, MATCH(TRUE, N$89:N$116<>\"\", 0)),OFFSET($H$57,$D$50-1,($D$6-1)*4))","v":48.326089232894901},{"$f":"(1000*J123/60)*($D$10*$G$34*$D$9)/($D$24*$D$20)","v":3992.5501679279173},{"$f":"INDEX(O$89:O$116, MATCH(TRUE, O$89:O$116<>\"\", 0))","v":6189.1484859202092},2,1,48.326089232894901,3992.5501679279173,null,{"$f":"(O123-O122)/2+O122","v":41.178057699510759},{"$f":"(P123-P122)/2+P122","v":3402.0021854203478},null,"2nd",null,null,null,null,48.326089232894901,6189.1484859202092]
[220,1734.4414814814813,null,null,null,null,null,null,null,{"$f":"IF($D$6-1-M124+1-N124>=0,INDEX(N$89:N$116, MATCH(TRUE, N$89:N$116<>\"\", 0)),OFFSET($H$57,$D$50-1,($D$6-1)*4))","v":48.326089232894901},{"$f":"(1000*J124/60)*($D$10*$G$35*$D$9)/($D$24*$D$20)","v":2854.8905842619788},{"$f":"INDEX(O$89:O$116, MATCH(TRUE, O$89:O$116<>\"\", 0))","v":6189.1484859202092},3,0,48.326089232894901,2854.8905842619788,null,null,null,null,null,null,null,null,null,48.326089232894901,6189.1484859202092]
[225,1806.9600000000003,null,null,null,null,"Vitesse en km/h intersection 3-4",null,null,{"$f":"IF($D$6-1-M125+1-N125>=0,INDEX(R$89:R$116, MATCH(TRUE, R$89:R$116<>\"\", 0)),OFFSET($H$57,$D$50-1,($D$6-1)*4))","v":66.735861797210745},{"$f":"(1000*J125/60)*($D$10*$G$35*$D$9)/($D$24*$D$20)","v":3942.4581318651144},{"$f":"INDEX(S$89:S$116, MATCH(TRUE, S$89:S$116<>\"\", 0))","v":4532.675268917722},3,1,66.735861797210745,3942.4581318651144,null,{"$f":"(O125-O124)/2+O124","v":57.530975515052823},{"$f":"(P125-P124)/2+P124","v":3398.6743580635466},null,"3rd",null,null,null,null,66.735861797210745,4532.675268917722]
[230,1881.1081481481483,null,null,null,null,null,null,null,{"$f":"IF($D$6-1-M126+1-N126>=0,INDEX(R$89:R$116, MATCH(TRUE, R$89:R$116<>\"\", 0)),OFFSET($H$57,$D$50-1,($D$6-1)*4))","v":66.735861797210745},{"$f":"(1000*J126/60)*($D$10*$G$36*$D$9)/($D$24*$D$20)","v":2895.8231689449799},{"$f":"INDEX(S$89:S$116, MATCH(TRUE, S$89:S$116<>\"\", 0))","v":4532.675268917722},4,0,66.735861797210745,2895.8231689449799,null,null,null,null,null,null,null,null,null,66.735861797210745,4532.675268917722]
[235,1956.8859259259259,null,null,null,null,"Vitesse en km/h intersection 4-5",null,null,{"$f":"IF($D$6-1-M127+1-N127>=0,INDEX(V$89:V$116, MATCH(TRUE,V$89:V$116<>\"\", 0)),OFFSET($H$57,$D$50-1,($D$6-1)*4))","v":89.848848948303313},{"$f":"(1000*J127/60)*($D$10*$G$36*$D$9)/($D$24*$D$20)","v":3898.7490605599569},{"$f":"INDEX(W$89:W$116, MATCH(TRUE, W$89:W$116<>\"\", 0))","v":3397.9922702229874},4,1,89.848848948303313,3898.7490605599569,null,{"$f":"(O127-O126)/2+O126","v":78.292355372757029},{"$f":"(P127-P126)/2+P126","v":3397.2861147524682},null,"4th",null,null,null,null,89.848848948303313,3397.9922702229874]
[240,2034.293333333334,null,null,null,null,null,null,null,{"$f":"IF($D$6-1-M128+1-N128>=0,INDEX(V$89:V$116, MATCH(TRUE,V$89:V$116<>\"\", 0)),OFFSET($H$57,$D$50-1,($D$6-1)*4))","v":89.848848948303313},{"$f":"(1000*J128/60)*($D$10*$G$37*$D$9)/($D$24*$D$20)","v":2929.9839599549782},{"$f":"INDEX(W$89:W$116, MATCH(TRUE, W$89:W$116<>\"\", 0))","v":3397.9922702229874},5,0,89.848848948303313,2929.9839599549782,null,null,null,null,null,null,null,null,null,89.848848948303313,3397.9922702229874]
[245,2113.3303703703705,null,null,null,null,"Vitesse en km/h intersection 5-6",null,null,{"$f":"IF($D$6-1-M129+1-N129>=0,INDEX(Z$89:Z$116, MATCH(TRUE, Z$89:Z$116<>\"\", 0)),OFFSET($H$57,$D$50-1,($D$6-1)*4))","v":118.37636186699197},{"$f":"(1000*J129/60)*($D$10*$G$37*$D$9)/($D$24*$D$20)","v":3860.2702824571047},{"$f":"INDEX(AA$89:AA$116, MATCH(TRUE, AA$89:AA$116<>\"\", 0))","v":2599.0683203085719},5,1,118.37636186699197,3860.2702824571047,null,{"$f":"(O129-O128)/2+O128","v":104.11260540764764},{"$f":"(P129-P128)/2+P128","v":3395.1271212060415},null,"5th",null,null,null,null,118.37636186699197,2599.0683203085719]
[250,2193.997037037037,null,null,null,null,null,null,null,{"$f":"IF($D$6-1-M130+1-N130>=0,INDEX(Z$89:Z$116, MATCH(TRUE, Z$89:Z$116<>\"\", 0)),OFFSET($H$57,$D$50-1,($D$6-1)*4))","v":118.37636186699197},{"$f":"(1000*J130/60)*($D$10*$G$38*$D$9)/($D$24*$D$20)","v":2958.833854294975},{"$f":"INDEX(AA$89:AA$116, MATCH(TRUE, AA$89:AA$116<>\"\", 0))","v":2599.0683203085719},6,0,118.37636186699197,2958.833854294975,null,null,null,null,null,null,null,null,null,{"$error":"#N/A"},{"$error":"#N/A"}]
[255,2276.2933333333335,null,null,null,null,"Vitesse en km/h intersection 6-7",null,null,{"$f":"IF($D$6-1-M131+1-N131>=0,INDEX(AD$89:AD$116, MATCH(TRUE, AD$89:AD$116<>\"\", 0)),OFFSET($H$57,$D$50-1,($D$6-1)*4))","v":196.03810207399172},{"$f":"(1000*J131/60)*($D$10*$G$38*$D$9)/($D$24*$D$20)","v":4900},{"$f":"INDEX(AE$89:AE$116, MATCH(TRUE, AE$89:AE$116<>\"\", 0))","v":{"$error":"#N/A"}},6,1,196.03810207399172,4900,null,{"$f":"(O131-O130)/2+O130","v":157.20723197049185},{"$f":"(P131-P130)/2+P130","v":3929.4169271474875},null,"6th",null,null,null,null,{"$error":"#N/A"},{"$error":"#N/A"}]
[260,2360.2192592592592,null,null,null,null,null,null,null,{"$f":"IF($D$6-1-M132+1-N132>=0,INDEX(AD$89:AD$116, MATCH(TRUE, AD$89:AD$116<>\"\", 0)),OFFSET($H$57,$D$50-1,($D$6-1)*4))","v":196.03810207399172},{"$f":"(1000*J132/60)*($D$10*$G$39*$D$9)/($D$24*$D$20)","v":{"$error":"#VALUE!"}},{"$f":"INDEX(AE$89:AE$116, MATCH(TRUE, AE$89:AE$116<>\"\", 0))","v":{"$error":"#N/A"}},7,0,null,null,null,null,null,null,null,null,null,null,null,{"$error":"#N/A"},{"$error":"#N/A"}]
[265,2445.7748148148153,null,null,null,null,"Vitesse en km/h intersection 7-8",null,null,{"$f":"IF($D$6-1-M133+1-N133>=0,INDEX(AH$89:AH$116, MATCH(TRUE, AH$89:AH$116<>\"\", 0)),OFFSET($H$57,$D$50-1,($D$6-1)*4))","v":196.03810207399172},{"$f":"(1000*J133/60)*($D$10*$G$39*$D$9)/($D$24*$D$20)","v":{"$error":"#VALUE!"}},{"$f":"INDEX(AI$89:AI$116, MATCH(TRUE, AI$89:AI$116<>\"\", 0))","v":{"$error":"#N/A"}},7,1,null,null,null,{"$f":"(O133-O132)/2+O132","v":0},0,null,"7th",null,null,null,null,{"$error":"#N/A"},{"$error":"#N/A"}]
[270,2532.9600000000005,null,null,null,null,null,null,null,{"$f":"IF($D$6-1-M134+1-N134>=0,INDEX(AH$89:AH$116, MATCH(TRUE, AH$89:AH$116<>\"\", 0)),OFFSET($H$57,$D$50-1,($D$6-1)*4))","v":196.03810207399172},{"$f":"(1000*J134/60)*($D$10*$G$40*$D$9)/($D$24*$D$20)","v":{"$error":"#VALUE!"}},{"$f":"INDEX(AI$89:AI$116, MATCH(TRUE, AI$89:AI$116<>\"\", 0))","v":{"$error":"#N/A"}},8,0,null,null,null,null,null,null,null,null,null,null,null,{"$error":"#N/A"},{"$error":"#N/A"}]
[275,2621.7748148148148,null,null,null,null,"Vitesse en km/h intersection 8-9",null,null,{"$f":"IF($D$6-1-M135+1-N135>=0,INDEX(AL$89:AL$116, MATCH(TRUE, AL$89:AL$116<>\"\", 0)),OFFSET($H$57,$D$50-1,($D$6-1)*4))","v":196.03810207399172},{"$f":"(1000*J135/60)*($D$10*$G$40*$D$9)/($D$24*$D$20)","v":{"$error":"#VALUE!"}},{"$f":"INDEX(AM$89:AM$116, MATCH(TRUE, AM$89:AM$116<>\"\", 0))","v":{"$error":"#N/A"}},8,1,null,null,null,0,0,null,"8th",null,null,null,null,{"$error":"#N/A"},{"$error":"#N/A"}]
[280,2712.2192592592592,null,null,null,null,null,null,null,{"$f":"IF($D$6-1-M136+1-N136>=0,INDEX(AL$89:AL$116, MATCH(TRUE, AL$89:AL$116<>\"\", 0)),OFFSET($H$57,$D$50-1,($D$6-1)*4))","v":196.03810207399172},{"$f":"(1000*J136/60)*($D$10*$G$41*$D$9)/($D$24*$D$20)","v":{"$error":"#VALUE!"}},{"$f":"INDEX(AM$89:AM$116, MATCH(TRUE, AM$89:AM$116<>\"\", 0))","v":{"$error":"#N/A"}},9,0,null,null,null,null,null,null,null,null,null,null,null,{"$error":"#N/A"},{"$error":"#N/A"}]
[285,2804.293333333334,null,null,null,null,"Vitesse en km/h intersection 9-10",null,null,{"$f":"IF($D$6-1-M137+1-N137>=0,INDEX(AP$89:AP$116, MATCH(TRUE, AP$89:AP$116<>\"\", 0)),OFFSET($H$57,$D$50-1,($D$6-1)*4))","v":196.03810207399172},{"$f":"(1000*J137/60)*($D$10*$G$41*$D$9)/($D$24*$D$20)","v":{"$error":"#VALUE!"}},{"$f":"INDEX(AQ$89:AQ$116, MATCH(TRUE, AQ$89:AQ$116<>\"\", 0))","v":{"$error":"#N/A"}},9,1,null,null,null,0,0,null,"9th",null,null,null,null,{"$error":"#N/A"},{"$error":"#N/A"}]
[290,2897.9970370370374,null,null,null,null,null,null,null,{"$f":"IF($D$6-1-M138+1-N138>=0,INDEX(AP$89:AP$116, MATCH(TRUE, AP$89:AP$116<>\"\", 0)),OFFSET($H$57,$D$50-1,($D$6-1)*4))","v":196.03810207399172},{"$f":"(1000*J138/60)*($D$10*$G$42*$D$9)/($D$24*$D$20)","v":{"$error":"#VALUE!"}},{"$f":"INDEX(AQ$89:AQ$116, MATCH(TRUE, AQ$89:AQ$116<>\"\", 0))","v":{"$error":"#N/A"}},10,0,null,null,null,null,null,null,null,null,null,null,null,{"$error":"#N/A"},{"$error":"#N/A"}]
[295,2993.3303703703709,null,null,null,null,"Vitesse en km/h intersection 10-11",null,null,{"$f":"IF($D$6-1-M139+1-N139>=0,INDEX(AT$89:AT$116, MATCH(TRUE, AT$89:AT$116<>\"\", 0)),OFFSET($H$57,$D$50-1,($D$6-1)*4))","v":196.03810207399172},{"$f":"(1000*J139/60)*($D$10*$G$42*$D$9)/($D$24*$D$20)","v":{"$error":"#VALUE!"}},{"$f":"INDEX(AU$89:AU$116, MATCH(TRUE, AU$89:AU$116<>\"\", 0))","v":{"$error":"#N/A"}},10,1,null,null,null,0,0,null,"10th",null,null,null,null,{"$error":"#N/A"},{"$error":"#N/A"}]
[300,3090.2933333333335,null,null,null,null,null,null,null,{"$f":"IF($D$6-1-M140+1-N140>=0,INDEX(AT$89:AT$116, MATCH(TRUE, AT$89:AT$116<>\"\", 0)),OFFSET($H$57,$D$50-1,($D$6-1)*4))","v":196.03810207399172},{"$f":"(1000*J140/60)*($D$10*$G$43*$D$9)/($D$24*$D$20)","v":{"$error":"#VALUE!"}},{"$f":"INDEX(AU$89:AU$116, MATCH(TRUE, AU$89:AU$116<>\"\", 0))","v":{"$error":"#N/A"}},11,0,null,null,null,null,null,null,null,null,null,null,null,{"$error":"#N/A"},{"$error":"#N/A"}]
[305,3188.8859259259257,null,null,null,null,"Vitesse en km/h intersection 11-12",null,null,{"$f":"IF($D$6-1-M141+1-N141>=0,INDEX(AX$89:AX$116, MATCH(TRUE, AX$89:AX$116<>\"\", 0)),OFFSET($H$57,$D$50-1,($D$6-1)*4))","v":196.03810207399172},{"$f":"(1000*J141/60)*($D$10*$G$43*$D$9)/($D$24*$D$20)","v":{"$error":"#VALUE!"}},{"$f":"INDEX(AY$89:AY$116, MATCH(TRUE, AY$89:AY$116<>\"\", 0))","v":{"$error":"#N/A"}},11,1,null,null,null,0,0,null,"11th",null,null,null,null,{"$error":"#N/A"},{"$error":"#N/A"}]
[310,3289.1081481481488,null,null,null,null,null,null,null,{"$f":"IF($D$6-1-M142+1-N142>=0,INDEX(AX$89:AX$116, MATCH(TRUE, AX$89:AX$116<>\"\", 0)),OFFSET($H$57,$D$50-1,($D$6-1)*4))","v":196.03810207399172},{"$f":"(1000*J142/60)*($D$10*$G$44*$D$9)/($D$24*$D$20)","v":{"$error":"#VALUE!"}},{"$f":"INDEX(AY$89:AY$116, MATCH(TRUE, AY$89:AY$116<>\"\", 0))","v":{"$error":"#N/A"}},12,0,null,null,null,null,null,null,null,null,null,null,null,{"$error":"#N/A"},{"$error":"#N/A"}]
[315,3390.9600000000005,null,null,null,null,"Vitesse en km/h intersection 12-13",null,null,{"$f":"IF($D$6-1-M143+1-N143>=0,INDEX(BB$89:BB$116, MATCH(TRUE, BB$89:BB$116<>\"\", 0)),OFFSET($H$57,$D$50-1,($D$6-1)*4))","v":196.03810207399172},{"$f":"(1000*J143/60)*($D$10*$G$44*$D$9)/($D$24*$D$20)","v":{"$error":"#VALUE!"}},{"$f":"INDEX(BC$89:BC$116, MATCH(TRUE, BC$89:BC$116<>\"\", 0))","v":{"$error":"#N/A"}},12,1,null,null,null,0,0,null,"12th",null,null,null,null,{"$error":"#N/A"},{"$error":"#N/A"}]
[320,{"$f":"(0.5*$D$30*$D$29*$D$28*(A144/3.6)^2)+$D$38","v":3494.4414814814818},null,null,null,null,null,null,null,{"$f":"IF($D$6-1-M144+1-N144>=0,INDEX(BB$89:BB$116, MATCH(TRUE, BB$89:BB$116<>\"\", 0)),OFFSET($H$57,$D$50-1,($D$6-1)*4))","v":196.03810207399172},{"$f":"(1000*J144/60)*($D$10*$G$45*$D$9)/($D$24*$D$20)","v":{"$error":"#VALUE!"}},{"$f":"INDEX(BC$89:BC$116, MATCH(TRUE, BC$89:BC$116<>\"\", 0))","v":{"$error":"#N/A"}},13,0,null,null,null,null,null,null,null,null,null,null,null,{"$error":"#N/A"},{"$error":"#N/A"}]
[325,3599.5525925925926,null,null,null,null,"Vitesse en km/h intersection 13-14",null,null,{"$f":"IF($D$6-1-M145+1-N145>=0,INDEX(BF$89:BF$116, MATCH(TRUE, BF$89:BF$116<>\"\", 0)),OFFSET($H$57,$D$50-1,($D$6-1)*4))","v":196.03810207399172},{"$f":"(1000*J145/60)*($D$10*$G$45*$D$9)/($D$24*$D$20)","v":{"$error":"#VALUE!"}},{"$f":"INDEX(BG$89:BG$116, MATCH(TRUE, BG$89:BG$116<>\"\", 0))","v":{"$error":"#N/A"}},13,1,null,null,null,0,0,null,"13th",null,null,null,null,{"$error":"#N/A"},{"$error":"#N/A"}]
[330,3706.2933333333344,null,null,null,null,null,null,null,{"$f":"IF($D$6-1-M146+1-N146>=0,INDEX(BF$89:BF$116, MATCH(TRUE, BF$89:BF$116<>\"\", 0)),OFFSET($H$57,$D$50-1,($D$6-1)*4))","v":196.03810207399172},{"$f":"(1000*J146/60)*($D$10*$G$46*$D$9)/($D$24*$D$20)","v":{"$error":"#VALUE!"}},{"$f":"INDEX(BG$89:BG$116, MATCH(TRUE, BG$89:BG$116<>\"\", 0))","v":{"$error":"#N/A"}},14,0,null,null,null,null,null,null,null,null,null,null,null,{"$error":"#N/A"},{"$error":"#N/A"}]
[335,3814.663703703704,null,null,null,null,"Vitesse en km/h intersection 14-15",null,null,{"$f":"IF($D$6-1-M147+1-N147>=0,INDEX(BJ$89:BJ$116, MATCH(TRUE, BJ$89:BJ$116<>\"\", 0)),OFFSET($H$57,$D$50-1,($D$6-1)*4))","v":196.03810207399172},{"$f":"(1000*J147/60)*($D$10*$G$46*$D$9)/($D$24*$D$20)","v":{"$error":"#VALUE!"}},{"$f":"INDEX(BK$89:BK$116, MATCH(TRUE, BK$89:BK$116<>\"\", 0))","v":{"$error":"#N/A"}},14,1,null,null,null,0,0,null,"14th",null,null,null,null,{"$error":"#N/A"},{"$error":"#N/A"}]
[340,3924.663703703704,null,null,null,null,null,null,null,{"$f":"IF($D$6-1-M148+1-N148>=0,INDEX(BJ$89:BJ$116, MATCH(TRUE, BJ$89:BJ$116<>\"\", 0)),OFFSET($H$57,$D$50-1,($D$6-1)*4))","v":196.03810207399172},{"$f":"(1000*J148/60)*($D$10*$G$47*$D$9)/($D$24*$D$20)","v":{"$error":"#VALUE!"}},{"$f":"INDEX(BK$89:BK$116, MATCH(TRUE, BK$89:BK$116<>\"\", 0))","v":{"$error":"#N/A"}},15,0,null,null,null,null,null,null,null,null,null,null,null,{"$error":"#N/A"},{"$error":"#N/A"}]
[345,4036.2933333333335,null,null,null,null,"Vitesse en km/h intersection 15-16",null,null,{"$f":"IF($D$6-1-M149+1-N149>=0,INDEX(BN$89:BN$116, MATCH(TRUE, BN$89:BN$116<>\"\", 0)),OFFSET($H$57,$D$50-1,($D$6-1)*4))","v":196.03810207399172},{"$f":"(1000*J149/60)*($D$10*$G$47*$D$9)/($D$24*$D$20)","v":{"$error":"#VALUE!"}},{"$f":"INDEX(BO$89:BO$116, MATCH(TRUE, BO$89:BO$116<>\"\", 0))","v":{"$error":"#N/A"}},15,1,null,null,null,0,0,null,"15th",null,null,null,null,{"$error":"#N/A"},{"$error":"#N/A"}]
[350,4149.5525925925922,null,null,null,null,null,null,null,{"$f":"IF($D$6-1-M150+1-N150>=0,INDEX(BN$89:BN$116, MATCH(TRUE, BN$89:BN$116<>\"\", 0)),OFFSET($H$57,$D$50-1,($D$6-1)*4))","v":196.03810207399172},{"$f":"(1000*J150/60)*($D$10*$G$48*$D$9)/($D$24*$D$20)","v":{"$error":"#VALUE!"}},{"$f":"INDEX(BO$89:BO$116, MATCH(TRUE, BO$89:BO$116<>\"\", 0))","v":{"$error":"#N/A"}},16,0,null,null,null,null,null,null,null,null,null,null,null,{"$error":"#N/A"},{"$error":"#N/A"}]
[351,4172.4000000000005,null,null,null,null,"Vitesse en km/h intersection 16-17",null,null,{"$f":"IF($D$6-1-M151+1-N151>=0,INDEX(BR$89:BR$116, MATCH(TRUE, BR$89:BR$116<>\"\", 0)),OFFSET($H$57,$D$50-1,($D$6-1)*4))","v":196.03810207399172},{"$f":"(1000*J151/60)*($D$10*$G$48*$D$9)/($D$24*$D$20)","v":{"$error":"#VALUE!"}},{"$f":"INDEX(BS$89:BS$116, MATCH(TRUE, BS$89:BS$116<>\"\", 0))","v":{"$error":"#N/A"}},16,1,null,null,null,0,0,null,"16th",null,null,null,null,{"$error":"#N/A"},{"$error":"#N/A"}]
[352,4195.3125925925924,null,null,null,null,null,null,null,{"$f":"IF($D$6-1-M152+1-N152>=0,INDEX(BR$89:BR$116, MATCH(TRUE, BR$89:BR$116<>\"\", 0)),OFFSET($H$57,$D$50-1,($D$6-1)*4))","v":196.03810207399172},{"$f":"(1000*J152/60)*($D$10*$G$49*$D$9)/($D$24*$D$20)","v":{"$error":"#VALUE!"}},{"$f":"INDEX(BS$89:BS$116, MATCH(TRUE, BS$89:BS$116<>\"\", 0))","v":{"$error":"#N/A"}},17,0,null,null,null,null,null,null,null,null,null,null,null,{"$error":"#N/A"},{"$error":"#N/A"}]
[353,4218.2903703703714,null,null,null,null,"Vitesse en km/h intersection 17-18",null,null,{"$f":"IF($D$6-1-M153+1-N153>=0,INDEX(BV$89:BV$116, MATCH(TRUE, BV$89:BV$116<>\"\", 0)),OFFSET($H$57,$D$50-1,($D$6-1)*4))","v":196.03810207399172},{"$f":"(1000*J153/60)*($D$10*$G$49*$D$9)/($D$24*$D$20)","v":{"$error":"#VALUE!"}},{"$f":"INDEX(BW$89:BW$116, MATCH(TRUE, BW$89:BW$116<>\"\", 0))","v":{"$error":"#N/A"}},17,1,null,null,null,0,0,null,"17th",null,null,null,null,{"$error":"#N/A"},{"$error":"#N/A"}]
[354,4241.333333333333,null,null,null,null,null,null,null,{"$f":"IF($D$6-1-M154+1-N154>=0,INDEX(BV$89:BV$116, MATCH(TRUE, BV$89:BV$116<>\"\", 0)),OFFSET($H$57,$D$50-1,($D$6-1)*4))","v":196.03810207399172},{"$f":"(1000*J154/60)*($D$10*$G$50*$D$9)/($D$24*$D$20)","v":{"$error":"#VALUE!"}},{"$f":"INDEX(BW$89:BW$116, MATCH(TRUE, BW$89:BW$116<>\"\", 0))","v":{"$error":"#N/A"}},18,0,null,null,null,null,null,null,null,null,null,null,null,{"$error":"#N/A"},{"$error":"#N/A"}]
[355,4264.4414814814827,null,null,null,null,"Vitesse en km/h intersection 18-19",null,null,{"$f":"IF($D$6-1-M155+1-N155>=0,INDEX(BZ$89:BZ$116, MATCH(TRUE, BZ$89:BZ$116<>\"\", 0)),OFFSET($H$57,$D$50-1,($D$6-1)*4))","v":196.03810207399172},{"$f":"(1000*J155/60)*($D$10*$G$50*$D$9)/($D$24*$D$20)","v":{"$error":"#VALUE!"}},{"$f":"INDEX(CA$89:CA$116, MATCH(TRUE, CA$89:CA$116<>\"\", 0))","v":{"$error":"#N/A"}},18,1,null,null,null,0,0,null,"18th",null,null,null,null,{"$error":"#N/A"},{"$error":"#N/A"}]
[356,4287.614814814815,null,null,null,null,null,null,null,{"$f":"IF($D$6-1-M156+1-N156>=0,INDEX(BZ$89:BZ$116, MATCH(TRUE, BZ$89:BZ$116<>\"\", 0)),OFFSET($H$57,$D$50-1,($D$6-1)*4))","v":196.03810207399172},{"$f":"(1000*J156/60)*($D$10*$G$51*$D$9)/($D$24*$D$20)","v":{"$error":"#VALUE!"}},{"$f":"INDEX(CA$89:CA$116, MATCH(TRUE, CA$89:CA$116<>\"\", 0))","v":{"$error":"#N/A"}},19,0,null,null,null,null,null,null,null,null,null,null,null,{"$error":"#N/A"},{"$error":"#N/A"}]
[357,4310.8533333333326,null,null,null,null,"Vitesse en km/h intersection 19-20",null,null,{"$f":"IF($D$6-1-M157+1-N157>=0,INDEX(CD$89:CD$116, MATCH(TRUE, CD$89:CD$116<>\"\", 0)),OFFSET($H$57,$D$50-1,($D$6-1)*4))","v":196.03810207399172},{"$f":"(1000*J157/60)*($D$10*$G$51*$D$9)/($D$24*$D$20)","v":{"$error":"#VALUE!"}},{"$f":"INDEX(CE$89:CE$116, MATCH(TRUE, CE$89:CE$116<>\"\", 0))","v":{"$error":"#N/A"}},19,1,null,null,null,0,0,null,"19th",null,null,null,null,{"$error":"#N/A"},{"$error":"#N/A"}]
[358,4334.1570370370373,null,null,null,null,null,null,null,{"$f":"IF($D$6-1-M158+1-N158>=0,INDEX(CD$89:CD$116, MATCH(TRUE, CD$89:CD$116<>\"\", 0)),OFFSET($H$57,$D$50-1,($D$6-1)*4))","v":196.03810207399172},{"$f":"(1000*J158/60)*($D$10*$G$52*$D$9)/($D$24*$D$20)","v":{"$error":"#VALUE!"}},{"$f":"INDEX(CE$89:CE$116, MATCH(TRUE, CE$89:CE$116<>\"\", 0))","v":{"$error":"#N/A"}},20,0]
[359,4357.5259259259265,null,null,null,null,null,null,null,{"$f":"IF($D$6-1-M159+1-N159>=0,INDEX(J$89:J$116, MATCH(TRUE, J$89:J$116<>\"\", 0)),OFFSET($H$57,$D$50-1,($D$6-1)*4))","v":196.03810207399172},{"$f":"(1000*J159/60)*($D$10*$G$52*$D$9)/($D$24*$D$20)","v":{"$error":"#VALUE!"}},null,20,1,null,null,null,{"$f":"(O159-O158)/2+O158","v":0},{"$f":"(P159-P158)/2+P158","v":0},null,"20th"]
[360,4380.9600000000009]
[361,4404.4592592592599]
[362,4428.0237037037041,null,null,{"$f":"_xlfn.LET(\n    _xlpm.Test_impair, MOD(_xlfn.SEQUENCE(1, 2*$D$6), 2) = 1,\n    _xlpm.Id_label, _xlfn.SEQUENCE(1, 2*$D$6, 2) / 2,\n    _xlpm.Labels_Speed, \"Speed \" & _xlpm.Id_label,\n    _xlpm.Labels_Effective_Power, \"Effective Power \" & _xlpm.Id_label - 0.5,\n    IF(_xlpm.Test_impair,_xlpm.Labels_Speed,_xlpm.Labels_Effective_Power)\n)","v":"Speed 1"},"Effective Power 1","Speed 2","Effective Power 2","Speed 3","Effective Power 3","Speed 4","Effective Power 4","Speed 5","Effective Power 5","Speed 6","Effective Power 6"]
[363,4451.6533333333336,null,null,{"$f":"_xlfn.LET(\n    _xlpm.Test_Rapports, MOD(_xlfn.SEQUENCE(1, 2*$D$6), 2) = 1,\n    _xlpm.Id_Rapports, _xlfn.SEQUENCE(1, 2*$D$6, 2) / 2,\n    _xlpm.Rapports, INDEX($G$33:INDIRECT(\"$G$\" & (ROW($G$33) + $D$6)), _xlpm.Id_Rapports),\n    _xlpm.Id_RPM, _xlfn.SEQUENCE($D$50),\n    _xlpm.RPM, INDEX($E$57:INDIRECT(\"$E$\" & (ROW($E$57) + $D$50)), _xlpm.Id_RPM),\n    _xlpm.Vitesses, _xlpm.RPM / ($D$48 * _xlpm.Rapports),\n    _xlpm.Torques, INDEX($F$57:INDIRECT(\"$F$\" & (ROW($F$57) + $D$50)), _xlpm.Id_RPM),\n    _xlpm.Tractions, _xlpm.Torques * $D$49 * _xlpm.Rapports / $D$21,\n    _xlpm.Frictions, 0.5 * $D$30 * $D$29 * $D$28 * (_xlpm.Vitesses / 3.6)^2 + $D$38,\n    _xlpm.Effective_Power,IF(_xlpm.Test_Rapports, _xlpm.Vitesses, _xlpm.Vitesses * (_xlpm.Tractions - _xlpm.Frictions) / 3.6),\n    IF(_xlpm.Effective_Power > 0, _xlpm.Effective_Power, 0)\n)","v":6.2869362181163533},5928.2853253047906,9.0780492167194584,5802.0693433322067,12.695606313066742,5632.5912651511871,17.284168758875978,5404.3078550278733,22.998978025894363,5091.7508224164039,30.005831950100774,4651.8041868757746]
[364,4475.3481481481485,null,null,8.3825816241551383,10729.480751603685,12.104065622292611,10556.501785027731,16.927475084088989,10318.343144273495,23.045558345167972,9984.6979141235606,30.665304034525814,9502.2160276806699,40.007775933467698,8776.1931608684863]
[365,4499.1081481481488,null,null,10.478227030193922,17204.19248521698,15.130082027865763,16980.429684941224,21.159343855111235,16663.143736031292,28.806947931459966,16199.050385867162,38.331630043157269,15490.295780197765,50.009719916834626,14358.687522607157]
[366,4522.9333333333334,null,null,12.573872436232707,24880.681684456162,18.156098433438917,24601.108989110064,25.391212626133484,24191.637300066359,34.568337517751957,23565.73795490354,45.997956051788726,22560.275798263789,60.011663900201548,20873.695700511165]
[367,4546.8237037037043,null,null,14.669517842271491,34151.147487369926,21.182114839012069,33809.733623308821,29.62308139715573,33292.406075757637,40.329727104043947,32467.071285614773,53.664282060420177,31080.379779912029,70.013607883568469,28659.564102737098]
[368,4570.7792592592596,null,null,16.765163248310277,45303.069276887283,24.208131244585221,44892.777758192417,33.854950168177979,44249.31254736444,46.091116690335944,43180.641287263257,61.330608069051628,41314.111668056124,80.015551866935397,37949.919382321852]
[369,4594.8,null,null,18.860808654349061,58021.78784399922,27.234147650158373,57534.576972477735,38.086818939200228,56744.080607208023,51.852506276627935,55381.900277173343,68.996934077683079,52922.836813671645,90.017495850302325,48376.24960036431]
[370,4618.8859259259261,null,null,20.956454060387845,69688.809367064227,30.260164055731526,69115.632232249118,42.31868771022247,68154.599534977111,57.613895862919932,66442.46596003689,76.663260086314537,63264.085955101706,100.01943983366925,57266.20820533084]
[371,4643.0370370370374,null,null,23.052099466426629,79518.235739034761,33.286180461304681,78849.040218184993,46.550556481244719,77691.354324954504,63.375285449211923,75566.551755139779,84.329586094945995,71527.985545283402,110.02138381703617,63780.044360281834]
[372,{"$f":"(0.5*$D$30*$D$29*$D$28*(A172/3.6)^2)+$D$38","v":4667.253333333334},null,null,25.147744872465413,85153.372526068473,36.312196866877834,84377.101284168806,50.782425252266968,82994.033644628085,69.136675035503913,80387.574754973015,91.995912103577453,75333.865710358936,120.0233278004031,65507.210901482766]
[373,4691.5348148148159,null,null,27.243390278504197,87117.31856011365,39.338213272450986,86221.909049874812,55.014294023289217,84582.119427276397,74.898064621795911,81418.745317818219,99.662238112208897,75180.849842261188,130.02527178377002,62916.953930989854]
[374,4715.8814814814814,null,null,29.339035684542981,88289.367163310846,42.364229678024138,87261.751625169403,59.246162794311459,85331.288096370306,80.659454208087894,81529.46829214938,107.32856412084035,73924.255823115396,140.02721576713694,58834.714041051542]
[375,4740.2933333333331,null,null,31.434681090581766,85527.425738420265,45.39024608359729,84353.53120053868,63.478031565333708,82095.830156000273,86.420843794379891,77567.762607060038,114.99489012947181,68398.0156156663,150.02915975050388,50064.545904535888]
[376,4764.770370370371,null,null,33.530326496620553,81134.82895442436,48.416262489170443,79799.577232691008,67.709900336355958,77175.463376479034,92.182233380671889,71827.074457866082,122.66121613810326,60881.48844888102,160.03110373387079,38855.931460533284]
[377,4789.3125925925924,null,null,39.398133633529149,66634.179980148547,56.889108424775273,64758.355837279218,79.559132895218255,60877.642859411462,108.31412422228946,52678.498774589047,144.12692896227134,35516.515344155559,188.03654688729819,514.59075600672236]
[378,4813.920000000001,null,null,40.236391795944662,63001.062985482895,58.099514987004532,61036.434165624982,81.251880403627155,56946.12040024317,110.61868005680627,48267.477033426585,147.19345936572392,30055.15497616263,192.03732448064497,0]
[379,4838.5925925925931,null,null,41.074649958360176,23238.094647641698,59.309921549233792,21181.57313868912,82.944627912036054,16873.635485185932,112.92323589132306,7696.2265579847353,150.25998976917649,0,196.03810207399172,0]
[380,4863.3303703703705]
[381,4888.1333333333332]
[382,4913.0014814814822]
[383,4937.9348148148156]
[384,4962.9333333333334]
[385,4987.9970370370374]
[386,5013.1259259259259]
[387,5038.3200000000006]
[388,5063.5792592592597]
[389,5088.9037037037051]
[390,5114.2933333333331]
[391,5139.7481481481491]
[392,5165.2681481481486]
[393,5190.8533333333335]
[394,5216.5037037037046]
[395,5242.2192592592592]
[396,5268.0000000000009]
[397,5293.8459259259262]
[398,5319.7570370370377]
[399,5345.7333333333336]
[400,5371.7748148148157]
[401,5397.8814814814823]
[402,5424.0533333333333]
[403,5450.2903703703714]
[404,5476.5925925925922]
[405,5502.9600000000009]
[406,5529.3925925925923]
[407,5555.8903703703709]
[408,{"$f":"(0.5*$D$30*$D$29*$D$28*(A208/3.6)^2)+$D$38","v":5582.4533333333338}]
[409,5609.081481481483]
[410,5635.7748148148148]
[411,5662.5333333333328]
[412,5689.3570370370371]
[413,5716.2459259259258]
[414,5743.2000000000007]
[415,5770.2192592592592]
[416,5797.3037037037047]
[417,5824.4533333333338]
[418,5851.6681481481492]
[419,5878.9481481481489]
[420,5906.2933333333331]
[421,5933.7037037037044]
[422,5961.1792592592592]
[423,5988.7200000000012,null,null,{"$f":"_xlfn.LET(\n    _xlpm.Test_impair, MOD(_xlfn.SEQUENCE(1, 2*$D$6), 2) = 1,\n    _xlpm.Id_label, _xlfn.SEQUENCE(1, 2*$D$6, 2) / 2,\n    _xlpm.Labels_RPM, \"RPM \" & _xlpm.Id_label,\n    _xlpm.Labels_Traction, \"Traction \" & _xlpm.Id_label - 0.5,\n    IF(_xlpm.Test_impair,_xlpm.Labels_RPM,_xlpm.Labels_Traction)\n)","v":"RPM 1"},"Traction 1","RPM 2","Traction 2","RPM 3","Traction 3","RPM 4","Traction 4","RPM 5","Traction 5","RPM 6","Traction 6"]
[424,6016.3259259259257,null,null,{"$f":"_xlfn.LET(\n    _xlpm.Test_Rapports, MOD(_xlfn.SEQUENCE(1, 2*$D$6), 2) = 1,\n    _xlpm.Id_Rapports, _xlfn.SEQUENCE(1, 2*$D$6, 2) / 2,\n    _xlpm.Rapports, INDEX($G$33:INDIRECT(\"$G$\" & (ROW($G$33) + $D$6)), _xlpm.Id_Rapports),\n    _xlpm.Id_RPM, _xlfn.SEQUENCE($D$50),\n    _xlpm.RPM, INDEX($E$57:INDIRECT(\"$E$\" & (ROW($E$57) + $D$50)), _xlpm.Id_RPM),\n    _xlpm.Vitesses, _xlpm.RPM / ($D$48 * _xlpm.Rapports),\n    _xlpm.Torques, INDEX($F$57:INDIRECT(\"$F$\" & (ROW($F$57) + $D$50)), _xlpm.Id_RPM),\n    _xlpm.Tractions, _xlpm.Torques * $D$49 * _xlpm.Rapports / $D$21,\n    _xlpm.Frictions, 0.5 * $D$30 * $D$29 * $D$28 * (_xlpm.Vitesses / 3.6)^2 + $D$38,\n    IF(_xlpm.Test_Rapports, _xlpm.RPM, _xlpm.Tractions)\n)","v":750},3552.8790164370075,750,2460.5202322416212,750,1759.4058303488605,750,1292.3227074806705,750,971.2050571062199,750,744.41274630108717]
[425,6043.9970370370374,null,null,1000,4767.1541233205417,1000,3301.4575268052135,1000,2360.7217470503701,1000,1734.0026201639378,1000,1303.1358994083457,1000,998.83229250525642]
[426,6071.7333333333336,null,null,1250,6071.3755344176716,1250,4204.6864728179607,1250,3006.5795835075469,1250,2208.3995634163357,1250,1659.654211510629,1250,1272.0977310208455]
[427,6099.5348148148159,null,null,1500,7285.6506413012057,1500,5045.6237673815531,1500,3607.8955002090565,1500,2650.0794760996027,1500,1991.5850538127547,1500,1526.5172772250144]
[428,6127.4014814814818,null,null,1750,8544.8989002915387,1750,5917.7068876697222,1750,4231.4823767883991,1750,3108.117904067436,1750,2335.8096310149595,1750,1790.3597695848937]
[429,6155.333333333333,null,null,2000,9894.0934634954647,2000,6852.0816594070466,2000,4899.6111731234096,2000,3598.8733626043991,2000,2704.6216780173213,2000,2073.0481542561924]
[430,6183.3303703703714,null,null,2250,11243.288026699391,2250,7786.4564311443719,2250,5567.7399694584201,2250,4089.6288211413626,2250,3073.4337250196832,2250,2355.7365389274914]
[431,6211.3925925925932,null,null,2500,12142.751068835343,2500,8409.3729456359215,2500,6013.1591670150938,2500,4416.7991268326714,2500,3319.308423021258,2500,2544.1954620416909]
[432,6239.52,null,null,2750,12592.482589903319,2750,8720.8312028816963,2750,6235.8687657934306,2750,4580.3842796783265,2750,3442.2457720220455,2750,2638.4249235987909]
[433,6267.712592592592,null,null,3000,12367.61682936933,3000,8565.102074258808,3000,6124.5139664042608,3000,4498.5917032554989,3000,3380.7770975216513,3000,2591.3101928202404]
[434,6295.9703703703717,null,null,3250,11693.019547767368,3250,8097.9146883901476,3250,5790.4495682367569,3250,4253.2139739870172,3250,3196.3710740204706,3250,2449.9660004845914]
[435,6324.293333333334,null,null,3500,11018.422266165404,3500,7630.7273025214845,3500,5456.3851700692512,3500,4007.8362447185355,3500,3011.9650505192894,3500,2308.6218081489419]
[436,6352.6814814814825,null,null,3750,9984.0397677090605,3750,6914.3733108562019,3750,4944.1530928790771,3750,3631.5903931735297,3750,2729.2091478174789,3750,2091.8940465676123]
[437,6381.1348148148154,null,null,4000,8904.6841171459182,4000,6166.8734934663426,4000,4409.6500558110683,4000,3238.9860263439591,4000,2434.1595102155893,4000,1865.7433388305733]
[438,6409.6533333333336,null,null,4700,6296.2412949516593,4700,4360.4156014408481,4700,3117.9343828967153,4700,2290.1921398391632,4700,1721.1228860110227,4700,1319.2124617993954]
[439,6438.2370370370381,null,null,4800,5846.5097738836839,4800,4048.9573441950738,4800,2895.2247841183785,4800,2126.6069869935086,4800,1598.1855370102353,4800,1224.9830002422957]
[440,6466.8859259259252,null,null,4900,2248.6576053398785,4900,1557.2912862288742,4900,1113.547993891684,4900,817.92576422827267,4900,614.68674500393672,4900,471.14730778549836]
[441,6495.6000000000013]
[442,6524.3792592592599]
[443,6553.2237037037048]
[444,6582.1333333333332]
[445,6611.1081481481488]
[446,6640.1481481481487]
[447,6669.2533333333331]
[448,6698.4237037037037]
[449,6727.6592592592588]
[450,6756.9600000000009]
[451,6786.3259259259266]
[452,6815.7570370370377]
[453,6845.253333333334]
[454,6874.8148148148157]
[455,6904.4414814814818]
[456,6934.1333333333332]
[457,6963.8903703703709]
[458,6993.712592592593]
[459,7023.6000000000013]
[460,7053.5525925925931]
[461,7083.5703703703703]
[462,7113.6533333333346]
[463,7143.8014814814824]
[464,7174.0148148148155]
[465,7204.2933333333322]
[466,7234.637037037036]
[467,7265.0459259259287]
[468,7295.5200000000013]
[469,7326.0592592592593]
[470,7356.6637037037035]
[471,7387.3333333333348]
[472,{"$f":"(0.5*$D$30*$D$29*$D$28*(A272/3.6)^2)+$D$38","v":7418.0681481481488}]
[473,7448.868148148149]
[474,7479.7333333333336]
[475,7510.6637037037035]
[476,7541.6592592592606]
[477,7572.7200000000012]
[478,7603.8459259259262]
[479,7635.0370370370365]
[480,7666.2933333333358]
[481,7697.6148148148168]
[482,7729.0014814814813]
[483,7760.4533333333329]
[484,7791.9703703703699]
[485,7823.552592592594]
[486,7855.2000000000007]
[487,7886.9125925925937]
[488,7918.6903703703701]
[489,7950.5333333333347]
[490,7982.4414814814827]
[491,8014.4148148148151]
[492,8046.4533333333329]
[493,8078.5570370370369]
[494,8110.7259259259281]
[495,8142.9600000000009]
[496,8175.2592592592591]
[497,8207.6237037037026]
[498,8240.0533333333351]
[499,8272.5481481481493]
[500,8305.1081481481488]

{"sheet":"Autres graphes","index":1,"n_rows":0,"n_cols":0,"rows_kept":0,"cut":false,"hidden":false,"merged":[]}

{"sheet":"Documentation","index":2,"n_rows":17,"n_cols":2,"rows_kept":17,"cut":false,"hidden":false,"merged":[]}
[]
[]
[]
[null,"Progression Linéaire"]
[null,"Calcul du coefficient de progression linéraire"]
[]
[]
[]
[]
[null,"Calcul de chaque rapport en progression linéraire"]
[]
[]
[]
[]
[]
[null,"Progression Logarithmique"]
[null,"Calcul du rapport i en fonction de i, n, k, Rn, R1"]

{"sheet":"Manual","index":3,"n_rows":0,"n_cols":0,"rows_kept":0,"cut":false,"hidden":false,"merged":[]}

{"sheet":"Calculs de Vitesses","index":4,"n_rows":35,"n_cols":12,"rows_kept":35,"cut":false,"hidden":false,"merged":[[10,9,11,9],[10,10,11,10],[26,9,27,9],[26,10,27,10],[26,11,27,11]]}
[]
[null,"Vitesse mini rotation moteur tr/min",500]
[null,"Vitesse maxi rotation moteur tr/min",4000]
[null,"Couple moteur",380]
[null,"Nombre de roues",4]
[null,"Rapports de boite de Transfert"]
[null,"Vitesses courtes",2.488]
[null,"Vitesses longues",1]
[null,null,null,null,"Rapports Longs"]
[null,"Rapports de ponts ou réduction finale",3.7269999999999999]
[null,null,null,null,"Rapport sélectionné","Rapports Longs","Vitesse km/h","Vitesse maxi km/h","Couple maxi disponible","Couple par roue,\n répartition uniforme","Vitesse de rotation des roues en tr/min"]
[null,"Pneus"]
[null,"diamètre (pouces)",16,null,"AR",4.3129999999999997,{"$f":"$C$16*($C$2/$C$10)*$C$20*60/F13/1000","v":4.5009071791854707},{"$f":"$C$16*($C$3/$C$10)*$C$20*60/F13/1000","v":36.007257433483765},{"$f":"$C$4*$C$8*$C$10*F13","v":6108.3293799999992},{"$f":"I13/$C$5","v":1527.0823449999998},{"$f":"$C$2/$C$8/$C$10/F13","v":31.105067880278586}]
[null,"largeur (mm)",275]
[null,"hauteur de flancs (% de largeur)",70,null,1,4.0810000000000004,{"$f":"$C$16*($C$2/$C$10)*$C$20*60/F15/1000","v":4.7567784032901077},{"$f":"$C$16*($C$3/$C$10)*$C$20*60/F15/1000","v":38.054227226320862},{"$f":"$C$4*$C$8*$C$10*F15","v":5779.7570600000008},{"$f":"I15/$C$5","v":1444.9392650000002},{"$f":"$C$2/$C$8/$C$10/F15","v":32.873354022945726}]
[null,"Coefficient d'écrasement",0.97,null,2,2.294,{"$f":"$C$16*($C$2/$C$10)*$C$20*60/F16/1000","v":8.462254866533101},67.698038932264808,{"$f":"$C$4*$C$8*$C$10*F16","v":3248.9004399999999},812.22510999999997,{"$f":"$C$2/$C$8/$C$10/F16","v":58.481324223034669}]
[null,null,null,null,3,1.49,{"$f":"$C$16*($C$2/$C$10)*$C$20*60/F17/1000","v":13.028464875051634},104.22771900041307,{"$f":"$C$4*$C$8*$C$10*F17","v":2110.2273999999998},527.55684999999994,{"$f":"$C$2/$C$8/$C$10/F17","v":90.037689776940624}]
[null,"hauteur de flanc calculée (mm)",{"$f":"C14*C15/100","v":192.5},null,4,1,{"$f":"$C$16*($C$2/$C$10)*$C$20*60/F18/1000","v":19.412412663826935},155.29930131061548,{"$f":"$C$4*$C$8*$C$10*F18","v":1416.26},354.065,{"$f":"$C$2/$C$8/$C$10/F18","v":134.15615776764153}]
[null,"diamètre total calculé (mm)",{"$f":"C13*25.4+2*C18","v":791.4},null,5,0.88100000000000001,{"$f":"$C$16*($C$2/$C$10)*$C$20*60/F19/1000","v":22.034520617283693},176.27616493826955,{"$f":"$C$4*$C$8*$C$10*F19","v":1247.72506},311.931265,{"$f":"$C$2/$C$8/$C$10/F19","v":152.27713708018334}]
[null,"circonférence calculée (m)",{"$f":"PI()*C19/1000","v":2.4862564260509621}]
[]
[null,null,null,null,"Les valeurs de rapports et de couple indiquées ici sont celles du Toyota HDJ80 avec les rapports de ponts version Europe (3.72:1)"]
[null,"Les valeurs en vert sont modifiables"]
[]
[null,null,null,null,"Rapports Courts"]
[]
[null,null,null,null,"Rapport sélectionné","Rapports Courts","Vitesse km/h","Vitesse maxi km/h","Couple maxi disponible*","Couple par roue,\n répartition uniforme","Vitesse de rotation des roues en tr/min","Vitesse de rotation des roues en tr/s"]
[]
[null,null,null,null,"AR",{"$f":"F13*$C$7","v":10.730744},{"$f":"$C$16*($C$2/$C$10)*$C$20*60/$F29/1000","v":1.8090462938848355},{"$f":"$C$16*($C$3/$C$10)*$C$20*60/$F29/1000","v":14.472370351078684},{"$f":"$C$4*$C$8*$C$10*F29","v":15197.523497439999},{"$f":"I29/$C$5","v":3799.3808743599998},{"$f":"$C$2/$C$8/$C$10/F29","v":12.502036929372421},{"$f":"K29/60","v":0.20836728215620701}]
[]
[null,null,null,null,1,{"$f":"F15*$C$7","v":10.153528000000001},{"$f":"$C$16*($C$2/$C$10)*$C$20*60/$F31/1000","v":1.9118884257596898},{"$f":"$C$16*($C$3/$C$10)*$C$20*60/$F31/1000","v":15.295107406077518},{"$f":"$C$4*$C$8*$C$10*F31","v":14380.035565280003},{"$f":"I31/$C$5","v":3595.0088913200007},{"$f":"$C$2/$C$8/$C$10/F31","v":13.212762870958894},{"$f":"K31/60","v":0.22021271451598157}]
[null,null,null,null,2,{"$f":"F16*$C$7","v":5.7074720000000001},3.4012278402464231,27.209822721971385,{"$f":"$C$4*$C$8*$C$10*F32","v":8083.2642947200002},2020.81607368,{"$f":"$C$2/$C$8/$C$10/F32","v":23.505355395110396},0.39175592325183994]
[null,null,null,null,3,{"$f":"F17*$C$7","v":3.7071199999999997},5.236521252030399,41.892170016243192,{"$f":"$C$4*$C$8*$C$10*F33","v":5250.2457711999996},1312.5614427999999,{"$f":"$C$2/$C$8/$C$10/F33","v":36.188782064686748},0.60314636774477914]
[null,null,null,null,4,{"$f":"F18*$C$7","v":2.488},7.8024166655252944,62.419333324202356,{"$f":"$C$4*$C$8*$C$10*F34","v":3523.65488},880.91372000000001,{"$f":"$C$2/$C$8/$C$10/F34","v":53.921285276383252},0.89868808793972088]
[null,null,null,null,5,{"$f":"F19*$C$7","v":2.1919279999999999},8.8563185760786549,70.850548608629239,{"$f":"$C$4*$C$8*$C$10*F35","v":3104.3399492799999},776.08498731999998,{"$f":"$C$2/$C$8/$C$10/F35","v":61.204637090105848},1.0200772848350974]

{"sheet":"traductions","index":5,"n_rows":44,"n_cols":12,"rows_kept":44,"cut":false,"hidden":false,"merged":[]}
[]
[null,null,"langue"]
[null,"English","Français"]
[null,null,"English",null,"Français","English",null,null,null,null,null,{"$f":"HLOOKUP(traductions!$B$3,traductions!$E4:$F44,2,FALSE)","v":"Speed number (n)"}]
[null,null,null,1,"Nombre de vitesses (n)","Speed number (n)"]
[null,null,null,2,"Rapport de 1ère vitesse (R1)","First speed ratio (R1)"]
[null,null,null,3,"Rapport de dernière vitesse (Rn)","Last speed ratio (Rn)"]
["AZ",null,null,4,"Rapport de pont ou réduction finale","Differential gearing or final gearing"]
[null,null,null,5,"Rapport de transfert en vitesses longues","Transfercase long gearing ratio"]
[null,null,null,6,"Rapport de transfert en vitesses courtes","Transfercase short gearing ratio"]
[null,null,null,7,"Coefficient logarithmique (k)","Logarithmic coefficient (k)"]
[null,null,null,8,"Coefficient de progression linéaire calculé (r)","Calculated linear spacing coefficient (r)"]
[null,null,null,9,"Les valeurs en vert sont modifiables","Green values can be modified"]
[null,null,null,10,"Pneus","Tires"]
[null,null,null,11,"Diamètre (pouces)","Diameter (inches)"]
[null,null,null,12,"Largeur (mm)","Width (mm)"]
[null,null,null,13,"Hauteur de flancs (% de largeur)","Sidewall height (percent of width)"]
[null,null,null,14,"Coefficient d'écrasement","Crushing coefficient"]
[null,null,null,15,"Rayon effectif calculéen m","Calculated effective radius (m)"]
[null,null,null,16,"Hauteur de flanc calculée (mm)","Calculated flank height (mm)"]
[null,null,null,17,"Diamètre total calculé (mm)","Calculated total diameter (mm)"]
[null,null,null,18,"Circonférence calculée (m)","Calculated circumference (m)"]
[null,null,null,19,"Surface frontale en m²","Frontal area in m²"]
[null,null,null,20,"Coefficient de traînée","Drag coefficient"]
[null,null,null,21,"Densitée de l'air en kg/m3","Air density in kg/m3"]
[null,null,null,22,"Masse du véhicule en kg","Vehicle mass in kg"]
[null,null,null,23,"Coefficient de roulement","Rolling coefficient"]
[null,null,null,24,"Pesanteur en m/s²","Gravity in m/s²"]
[null,null,null,25,"Résistance au roulement calculée en N","Calculated rolling resistance in N"]
[null,null,null,26,"Progression Logarithmique (rapports longs)","Logarithmic spacing (long ratios)"]
[null,null,null,27,"Progression Logarithmique (rapports courts)","Logarithmic spacing (short ratios)"]
[null,null,null,28,"Progression Linéaire (rapports longs)","Linear spacing (long ratios)"]
[null,null,null,29,"Progression Linéaire (rapports courts)","Linear spacing (short ratios)"]
[null,null,null,30]
[null,null,null,31]
[null,null,null,32]
[null,null,null,33]
[null,null,null,34]
[null,null,null,35]
[null,null,null,36]
[null,null,null,37]
[null,null,null,38]
[null,null,null,39]
[null,null,null,40]