{"text_format":"1","workbook":"xlsx","n_sheets":6,"sheets":["Etagement","Autres graphes","Documentation","Manual","Calculs de Vitesses","traductions"],"not_rendered":{"charts":6,"images":1,"macros":1,"external_links":0,"defined_names":88,"comments":0,"pivot_tables":0},"unopened":[],"bounds":{"document_bytes":16777216,"sheet_cells":100000,"rows_first":2000,"rows_last":500,"rows_between":2000,"halvings":0,"cell_chars":16384,"cell_head_chars":4096},"cells_cut":0,"cells_raw":0,"read":"whole","date_system":"1900"}

{"sheet":"Etagement","index":0,"n_rows":300,"n_cols":85,"rows_kept":300,"cut":false,"hidden":false,"merged":[[29,17,30,19],[29,5,30,7],[29,9,30,11],[12,1,12,2],[4,1,4,2],[15,1,15,2],[29,13,30,15],[5,1,5,2],[8,1,8,2],[16,1,16,2],[17,1,17,2],[6,1,6,2],[7,1,7,2],[11,1,11,2]]}
[]
[null,"Copyright Olivier ADLER 2024",null,null,null,null,"RPM","Couple"]
[null,"MotorSport@StoneRecording.art",null,null,null,null,750,79]
["Version 5.0",null,null,null,null,null,1000,106]
[null,{"$f":"HLOOKUP(traductions!$B$3,traductions!$E4:$F44,10,FALSE)","v":"Green values can be modified"},null,null,null,null,1250,135]
[null,{"$f":"HLOOKUP(traductions!$B$3,traductions!$E4:$F44,2,FALSE)","v":"Speed number (n)"},null,6,null,null,1500,162]
[null,{"$f":"HLOOKUP(traductions!$B$3,traductions!$E4:$F44,3,FALSE)","v":"First speed ratio (R1)"},null,4.2,null,null,1750,190]
[null,{"$f":"HLOOKUP(traductions!$B$3,traductions!$E4:$F44,4,FALSE)","v":"Last speed ratio (Rn)"},null,0.88,null,null,2000,220]
[null,{"$f":"HLOOKUP(traductions!$B$3,traductions!$E4:$F44,5,FALSE)","v":"Differential gearing or final gearing"},null,4.1100000000000003,null,null,2250,250]
[null,{"$f":"HLOOKUP(traductions!$B$3,traductions!$E4:$F44,6,FALSE)","v":"Transfercase long gearing ratio"},null,1,null,null,2500,270]
[null,{"$f":"HLOOKUP(traductions!$B$3,traductions!$E4:$F44,7,FALSE)","v":"Transfercase short gearing ratio"},null,2.4900000000000002,null,null,2750,280]
[null,{"$f":"HLOOKUP(traductions!$B$3,traductions!$E4:$F44,8,FALSE)","v":"Logarithmic coefficient (k)"},null,0.1,null,null,3000,275]
[null,null,null,null,null,null,3250,260]
[null,{"$f":"HLOOKUP(traductions!$B$3,traductions!$E4:$F44,9,FALSE)","v":"Calculated linear spacing coefficient (r)"},null,{"$f":"(D8/D7)^(1/(D6-1))","v":0.73155448353600716},null,null,3500,245]
[null,null,null,null,null,null,3750,222]
[null,{"$f":"HLOOKUP(traductions!$B$3,traductions!$E4:$F44,11,FALSE)","v":"Tires"},null,null,null,null,4000,198]
[null,{"$f":"HLOOKUP(traductions!$B$3,traductions!$E4:$F44,12,FALSE)","v":"Diameter (inches)"},null,16,null,null,4700,140]
[null,{"$f":"HLOOKUP(traductions!$B$3,traductions!$E4:$F44,13,FALSE)","v":"Width (mm)"},null,275,null,null,4800,130]
[null,{"$f":"HLOOKUP(traductions!$B$3,traductions!$E4:$F44,14,FALSE)","v":"Sidewall height (percent of width)"},null,70,null,null,4900,50]
[null,{"$f":"HLOOKUP(traductions!$B$3,traductions!$E4:$F44,15,FALSE)","v":"Crushing coefficient"},null,0.97]
[null,{"$f":"HLOOKUP(traductions!$B$3,traductions!$E4:$F44,16,FALSE)","v":"Calculated effective radius (m)"},null,{"$f":"$D$23*$D$20/2/1000","v":0.38382899999999998}]
[null,{"$f":"HLOOKUP(traductions!$B$3,traductions!$E4:$F44,17,FALSE)","v":"Calculated flank height (mm)"},null,{"$f":"$D$18*$D$19/100","v":192.5}]
[null,{"$f":"HLOOKUP(traductions!$B$3,traductions!$E4:$F44,18,FALSE)","v":"Calculated total diameter (mm)"},null,{"$f":"$D$17*25.4+2*$D$22","v":791.4}]
[null,{"$f":"HLOOKUP(traductions!$B$3,traductions!$E4:$F44,19,FALSE)","v":"Calculated circumference (m)"},null,{"$f":"PI()*$D$23/1000","v":2.4862564260509621}]
[]
[null,"Résistance aérodynamique"]
[]
[null,null,{"$f":"HLOOKUP(traductions!$B$3,traductions!$E4:$F44,20,FALSE)","v":"Frontal area in m²"},2.2000000000000002]
[null,null,{"$f":"HLOOKUP(traductions!$B$3,traductions!$E4:$F44,21,FALSE)","v":"Drag coefficient"},0.32]
[null,null,{"$f":"HLOOKUP(traductions!$B$3,traductions!$E4:$F44,22,FALSE)","v":"Air density in kg/m3"},1.2,null,{"$f":"HLOOKUP(traductions!$B$3,traductions!$E4:$F44,27,FALSE)","v":"Logarithmic spacing (long ratios)"},null,null,null,{"$f":"HLOOKUP(traductions!$B$3,traductions!$E4:$F44,28,FALSE)","v":"Logarithmic spacing (short ratios)"},null,null,null,{"$f":"HLOOKUP(traductions!$B$3,traductions!$E4:$F44,29,FALSE)","v":"Linear spacing (long ratios)"},null,null,null,{"$f":"HLOOKUP(traductions!$B$3,traductions!$E4:$F44,30,FALSE)","v":"Linear spacing (short ratios)"}]
[]
[null,"Résistance au roulement ",null,null,null,"Vitesse","Rapport","Différences",null,"Vitesse","Rapport","Différences",null,"Vitesse","Rapport","Différences",null,"Vitesse","Rapport","Différences"]
[null,null,null,null,null,{"$f":"IF(20-(ROW(F$52)-ROW(F33))<=$D$6,20-(ROW(F$52)-ROW(F33)),\"\")","v":1},{"$f":"IF(F33<=$D$6,$D$43*($D$8/$D$7)^(LOG10((F33-1)*($D$12)+1)/$D$46),\"NA()\")","v":4.2},null,null,{"$f":"IF(20-(ROW(J$52)-ROW(J33))<=$D$6,20-(ROW(J$52)-ROW(J33)),\"\")","v":1},{"$f":"IF(J33<=$D$6,$D$44*($D$8/$D$7)^(LOG10((J33-1)*($D$12)+1)/$D$46),\"\")","v":10.458000000000002},null,null,{"$f":"IF(20-(ROW(N$52)-ROW(N33))<=$D$6,20-(ROW(N$52)-ROW(N33)),\"\")","v":1},{"$f":"IF(N33<=$D$6,$D$43*$D$14^(N33-1),\"\")","v":4.2},null,null,{"$f":"IF(20-(ROW(R$52)-ROW(R33))<=$D$6,20-(ROW(R$52)-ROW(R33)),\"\")","v":1},{"$f":"IF(R33<=$D$6,$D$44*$D$14^(R33-1),\"\")","v":10.458000000000002}]
[null,null,null,null,null,2,{"$f":"IF(F34<=$D$6,$D$43*($D$8/$D$7)^(LOG10((F34-1)*($D$12)+1)/$D$46),\"NA()\")","v":2.9086791099851217},{"$f":"IF(F34=\"\",\"\",(G34/G33)-1)","v":-0.30745735476544722},null,2,7.2426109838629547,{"$f":"IF(J34=\"\",\"\",(K34/K33)-1)","v":-0.30745735476544722},null,2,3.0725288308512302,{"$f":"IF(N34=\"\",\"\",(O34/O33)-1)","v":-0.26844551646399284},null,2,7.6505967888195645,{"$f":"IF(R34=\"\",\"\",(S34/S33)-1)","v":-0.26844551646399284}]
[null,null,{"$f":"HLOOKUP(traductions!$B$3,traductions!$E4:$F44,23,FALSE)","v":"Vehicle mass in kg"},1600,null,3,2.0798638099632658,{"$f":"IF(F35=\"\",\"\",(G35/G34)-1)","v":-0.28494559512482465},null,3,5.1788608868085326,-0.28494559512482476,null,3,2.247722242002864,-0.26844551646399273,null,3,5.5968283825871321,-0.26844551646399273]
[null,null,{"$f":"HLOOKUP(traductions!$B$3,traductions!$E4:$F44,24,FALSE)","v":"Rolling coefficient"},0.01,null,4,1.5277062197468301,-0.26547776232819198,null,4,3.8039884871696077,-0.26547776232819198,null,4,1.6443312838808011,{"$f":"IF(N36=\"\",\"\",(O36/O35)-1)","v":-0.26844551646399295},null,4,4.0943848968631951,-0.26844551646399295]
[null,null,{"$f":"HLOOKUP(traductions!$B$3,traductions!$E4:$F44,25,FALSE)","v":"Gravity in m/s²"},9.81,null,5,1.1481002367304913,-0.24848100905110315,null,5,2.858769589458924,-0.24848100905110315,null,5,1.2029179231415192,{"$f":"IF(N37=\"\",\"\",(O37/O36)-1)","v":-0.26844551646399273},null,5,2.9952656286223833,-0.26844551646399262]
[null,{"$f":"HLOOKUP(traductions!$B$3,traductions!$E4:$F44,26,FALSE)","v":"Calculated rolling resistance in N"},null,156.96,null,6,0.88,-0.2335164022733548,null,6,2.1912000000000003,-0.23351640227335491,null,6,0.88000000000000045,-0.26844551646399284,null,6,2.1912000000000011,-0.26844551646399295]
[null,null,null,null,null,"","NA()","",null,"","","",null,"","","",null,"","",""]
[null,null,null,null,null,"","NA()","",null,"","","",null,"","","",null,"","",""]
{"$rows_left_out":261}
{"sheet":"Autres graphes","index":1,"n_rows":0,"n_cols":0,"rows_kept":0,"cut":false,"hidden":false,"merged":[]}

{"sheet":"Documentation","index":2,"n_rows":17,"n_cols":2,"rows_kept":17,"cut":false,"hidden":false,"merged":[]}
[]
[]
[]
[null,"Progression Linéaire"]
[null,"Calcul du coefficient de progression linéraire"]
[]
[]
[]
[]
[null,"Calcul de chaque rapport en progression linéraire"]
[]
[]
[]
[]
[]
[null,"Progression Logarithmique"]
[null,"Calcul du rapport i en fonction de i, n, k, Rn, R1"]

{"sheet":"Manual","index":3,"n_rows":0,"n_cols":0,"rows_kept":0,"cut":false,"hidden":false,"merged":[]}

{"sheet":"Calculs de Vitesses","index":4,"n_rows":35,"n_cols":12,"rows_kept":35,"cut":false,"hidden":false,"merged":[[10,9,11,9],[10,10,11,10],[26,9,27,9],[26,10,27,10],[26,11,27,11]]}
[]
[null,"Vitesse mini rotation moteur tr/min",500]
[null,"Vitesse maxi rotation moteur tr/min",4000]
[null,"Couple moteur",380]
[null,"Nombre de roues",4]
[null,"Rapports de boite de Transfert"]
[null,"Vitesses courtes",2.488]
[null,"Vitesses longues",1]
[null,null,null,null,"Rapports Longs"]
[null,"Rapports de ponts ou réduction finale",3.7269999999999999]
[null,null,null,null,"Rapport sélectionné","Rapports Longs","Vitesse km/h","Vitesse maxi km/h","Couple maxi disponible","Couple par roue,\n répartition uniforme","Vitesse de rotation des roues en tr/min"]
[null,"Pneus"]
[null,"diamètre (pouces)",16,null,"AR",4.3129999999999997,{"$f":"$C$16*($C$2/$C$10)*$C$20*60/F13/1000","v":4.5009071791854707},{"$f":"$C$16*($C$3/$C$10)*$C$20*60/F13/1000","v":36.007257433483765},{"$f":"$C$4*$C$8*$C$10*F13","v":6108.3293799999992},{"$f":"I13/$C$5","v":1527.0823449999998},{"$f":"$C$2/$C$8/$C$10/F13","v":31.105067880278586}]
[null,"largeur (mm)",275]
[null,"hauteur de flancs (% de largeur)",70,null,1,4.0810000000000004,{"$f":"$C$16*($C$2/$C$10)*$C$20*60/F15/1000","v":4.7567784032901077},{"$f":"$C$16*($C$3/$C$10)*$C$20*60/F15/1000","v":38.054227226320862},{"$f":"$C$4*$C$8*$C$10*F15","v":5779.7570600000008},{"$f":"I15/$C$5","v":1444.9392650000002},{"$f":"$C$2/$C$8/$C$10/F15","v":32.873354022945726}]
[null,"Coefficient d'écrasement",0.97,null,2,2.294,{"$f":"$C$16*($C$2/$C$10)*$C$20*60/F16/1000","v":8.462254866533101},67.698038932264808,{"$f":"$C$4*$C$8*$C$10*F16","v":3248.9004399999999},812.22510999999997,{"$f":"$C$2/$C$8/$C$10/F16","v":58.481324223034669}]
[null,null,null,null,3,1.49,{"$f":"$C$16*($C$2/$C$10)*$C$20*60/F17/1000","v":13.028464875051634},104.22771900041307,{"$f":"$C$4*$C$8*$C$10*F17","v":2110.2273999999998},527.55684999999994,{"$f":"$C$2/$C$8/$C$10/F17","v":90.037689776940624}]
[null,"hauteur de flanc calculée (mm)",{"$f":"C14*C15/100","v":192.5},null,4,1,{"$f":"$C$16*($C$2/$C$10)*$C$20*60/F18/1000","v":19.412412663826935},155.29930131061548,{"$f":"$C$4*$C$8*$C$10*F18","v":1416.26},354.065,{"$f":"$C$2/$C$8/$C$10/F18","v":134.15615776764153}]
[null,"diamètre total calculé (mm)",{"$f":"C13*25.4+2*C18","v":791.4},null,5,0.88100000000000001,{"$f":"$C$16*($C$2/$C$10)*$C$20*60/F19/1000","v":22.034520617283693},176.27616493826955,{"$f":"$C$4*$C$8*$C$10*F19","v":1247.72506},311.931265,{"$f":"$C$2/$C$8/$C$10/F19","v":152.27713708018334}]
[null,"circonférence calculée (m)",{"$f":"PI()*C19/1000","v":2.4862564260509621}]
[]
[null,null,null,null,"Les valeurs de rapports et de couple indiquées ici sont celles du Toyota HDJ80 avec les rapports de ponts version Europe (3.72:1)"]
[null,"Les valeurs en vert sont modifiables"]
[]
[null,null,null,null,"Rapports Courts"]
[]
[null,null,null,null,"Rapport sélectionné","Rapports Courts","Vitesse km/h","Vitesse maxi km/h","Couple maxi disponible*","Couple par roue,\n répartition uniforme","Vitesse de rotation des roues en tr/min","Vitesse de rotation des roues en tr/s"]
[]
[null,null,null,null,"AR",{"$f":"F13*$C$7","v":10.730744},{"$f":"$C$16*($C$2/$C$10)*$C$20*60/$F29/1000","v":1.8090462938848355},{"$f":"$C$16*($C$3/$C$10)*$C$20*60/$F29/1000","v":14.472370351078684},{"$f":"$C$4*$C$8*$C$10*F29","v":15197.523497439999},{"$f":"I29/$C$5","v":3799.3808743599998},{"$f":"$C$2/$C$8/$C$10/F29","v":12.502036929372421},{"$f":"K29/60","v":0.20836728215620701}]
[]
[null,null,null,null,1,{"$f":"F15*$C$7","v":10.153528000000001},{"$f":"$C$16*($C$2/$C$10)*$C$20*60/$F31/1000","v":1.9118884257596898},{"$f":"$C$16*($C$3/$C$10)*$C$20*60/$F31/1000","v":15.295107406077518},{"$f":"$C$4*$C$8*$C$10*F31","v":14380.035565280003},{"$f":"I31/$C$5","v":3595.0088913200007},{"$f":"$C$2/$C$8/$C$10/F31","v":13.212762870958894},{"$f":"K31/60","v":0.22021271451598157}]
[null,null,null,null,2,{"$f":"F16*$C$7","v":5.7074720000000001},3.4012278402464231,27.209822721971385,{"$f":"$C$4*$C$8*$C$10*F32","v":8083.2642947200002},2020.81607368,{"$f":"$C$2/$C$8/$C$10/F32","v":23.505355395110396},0.39175592325183994]
[null,null,null,null,3,{"$f":"F17*$C$7","v":3.7071199999999997},5.236521252030399,41.892170016243192,{"$f":"$C$4*$C$8*$C$10*F33","v":5250.2457711999996},1312.5614427999999,{"$f":"$C$2/$C$8/$C$10/F33","v":36.188782064686748},0.60314636774477914]
[null,null,null,null,4,{"$f":"F18*$C$7","v":2.488},7.8024166655252944,62.419333324202356,{"$f":"$C$4*$C$8*$C$10*F34","v":3523.65488},880.91372000000001,{"$f":"$C$2/$C$8/$C$10/F34","v":53.921285276383252},0.89868808793972088]
[null,null,null,null,5,{"$f":"F19*$C$7","v":2.1919279999999999},8.8563185760786549,70.850548608629239,{"$f":"$C$4*$C$8*$C$10*F35","v":3104.3399492799999},776.08498731999998,{"$f":"$C$2/$C$8/$C$10/F35","v":61.204637090105848},1.0200772848350974]

{"sheet":"traductions","index":5,"n_rows":44,"n_cols":12,"rows_kept":44,"cut":false,"hidden":false,"merged":[]}
[]
[null,null,"langue"]
[null,"English","Français"]
[null,null,"English",null,"Français","English",null,null,null,null,null,{"$f":"HLOOKUP(traductions!$B$3,traductions!$E4:$F44,2,FALSE)","v":"Speed number (n)"}]
[null,null,null,1,"Nombre de vitesses (n)","Speed number (n)"]
[null,null,null,2,"Rapport de 1ère vitesse (R1)","First speed ratio (R1)"]
[null,null,null,3,"Rapport de dernière vitesse (Rn)","Last speed ratio (Rn)"]
["AZ",null,null,4,"Rapport de pont ou réduction finale","Differential gearing or final gearing"]
[null,null,null,5,"Rapport de transfert en vitesses longues","Transfercase long gearing ratio"]
[null,null,null,6,"Rapport de transfert en vitesses courtes","Transfercase short gearing ratio"]
[null,null,null,7,"Coefficient logarithmique (k)","Logarithmic coefficient (k)"]
[null,null,null,8,"Coefficient de progression linéaire calculé (r)","Calculated linear spacing coefficient (r)"]
[null,null,null,9,"Les valeurs en vert sont modifiables","Green values can be modified"]
[null,null,null,10,"Pneus","Tires"]
[null,null,null,11,"Diamètre (pouces)","Diameter (inches)"]
[null,null,null,12,"Largeur (mm)","Width (mm)"]
[null,null,null,13,"Hauteur de flancs (% de largeur)","Sidewall height (percent of width)"]
[null,null,null,14,"Coefficient d'écrasement","Crushing coefficient"]
[null,null,null,15,"Rayon effectif calculéen m","Calculated effective radius (m)"]
[null,null,null,16,"Hauteur de flanc calculée (mm)","Calculated flank height (mm)"]
[null,null,null,17,"Diamètre total calculé (mm)","Calculated total diameter (mm)"]
[null,null,null,18,"Circonférence calculée (m)","Calculated circumference (m)"]
[null,null,null,19,"Surface frontale en m²","Frontal area in m²"]
[null,null,null,20,"Coefficient de traînée","Drag coefficient"]
[null,null,null,21,"Densitée de l'air en kg/m3","Air density in kg/m3"]
[null,null,null,22,"Masse du véhicule en kg","Vehicle mass in kg"]
[null,null,null,23,"Coefficient de roulement","Rolling coefficient"]
[null,null,null,24,"Pesanteur en m/s²","Gravity in m/s²"]
[null,null,null,25,"Résistance au roulement calculée en N","Calculated rolling resistance in N"]
[null,null,null,26,"Progression Logarithmique (rapports longs)","Logarithmic spacing (long ratios)"]
[null,null,null,27,"Progression Logarithmique (rapports courts)","Logarithmic spacing (short ratios)"]
[null,null,null,28,"Progression Linéaire (rapports longs)","Linear spacing (long ratios)"]
[null,null,null,29,"Progression Linéaire (rapports courts)","Linear spacing (short ratios)"]
[null,null,null,30]
[null,null,null,31]
[null,null,null,32]
[null,null,null,33]
[null,null,null,34]
[null,null,null,35]
[null,null,null,36]
{"$rows_left_out":4}